HCH3(cyc-CCS)

Vibrational and/or electronic energy levels

Data compiled by: Marilyn E. Jacox

State:   X

Vib.
sym.
 No.   Approximate
 type of mode
 cm-1   Med.   Method   References

CH stretch 3203 w Ar IR Krantz and Laureni, 1977
Krantz and Laureni, 1981
CH stretch 2930 w Ar IR Krantz and Laureni, 1977
Krantz and Laureni, 1981
1440 m Ar IR Krantz and Laureni, 1977
Krantz and Laureni, 1981
1429 m Ar IR Krantz and Laureni, 1977
Krantz and Laureni, 1981
1036 m Ar IR Krantz and Laureni, 1977
Krantz and Laureni, 1981
897 m Ar IR Krantz and Laureni, 1977
Krantz and Laureni, 1981
650 w Ar IR Krantz and Laureni, 1977
Krantz and Laureni, 1981

Additional references: Jacox, 1994, page 379

References

Krantz and Laureni, 1977
Krantz, A.; Laureni, J., A methodology for the preparation and characterization of three-membered, potentially antiaromatic molecules. Preparation of matrix-isolated thiirene and selenirene, J. Am. Chem. Soc., 1977, 99, 14, 4842, https://doi.org/10.1021/ja00456a060 . [all data]

Krantz and Laureni, 1981
Krantz, A.; Laureni, J., Characterization of matrix-isolated antiaromatic three-membered heterocycles. Preparation of the elusive thiirene molecule, J. Am. Chem. Soc., 1981, 103, 3, 486, https://doi.org/10.1021/ja00393a002 . [all data]

Jacox, 1994
Jacox, M.E., Vibrational and electronic energy levels of polyatomic transient molecules, American Chemical Society, Washington, DC, 1994, 464. [all data]