1,1,3,3-tetrachloro-1,2,2-trifluoropropane

Phase change data

Data compiled by: Thermodynamics Research Center, NIST Boulder Laboratories, Chris Muzny director

Quantity Value Units Method Reference Comment
Tboil400.2KN/ACoffman, Cramer, et al., 1949Uncertainty assigned by TRC = 1. K

In addition to the Thermodynamics Research Center (TRC) data available from this site, much more physical and chemical property data is available from the following TRC products:

References

Coffman, Cramer, et al., 1949
Coffman, D.D.; Cramer, R.; Rigby, G.W., Synthesis of Chlorofluoropropanes, J. Am. Chem. Soc., 1949, 71, 979-80. [all data]