Ethylene oxalate

Phase change data

Data compiled as indicated in comments:
TRC - Thermodynamics Research Center, NIST Boulder Laboratories, Chris Muzny director
DH - Eugene S. Domalski and Elizabeth D. Hearing
AC - William E. Acree, Jr., James S. Chickos

Quantity Value Units Method Reference Comment
Ttriple415.KN/ALebedev, Kulagina, et al., 1982Uncertainty assigned by TRC = 1. K; TRC

Enthalpy of fusion

ΔfusH (kJ/mol) Temperature (K) Reference Comment
13.400415.Lebedev, Kulagina, et al., 1982, 2DH
13.4415.Domalski and Hearing, 1996AC

Entropy of fusion

ΔfusS (J/mol*K) Temperature (K) Reference Comment
32.29415.Lebedev, Kulagina, et al., 1982, 2DH

In addition to the Thermodynamics Research Center (TRC) data available from this site, much more physical and chemical property data is available from the following TRC products:

Condensed phase thermochemistry data

Data compiled as indicated in comments:
ALS - Hussein Y. Afeefy, Joel F. Liebman, and Stephen E. Stein
DH - Eugene S. Domalski and Elizabeth D. Hearing

Quantity Value Units Method Reference Comment
Δfsolid-166.6 ± 0.29kcal/molCcbLebedev, Kulagina, et al., 1982see Lebedev, Kulagina, et al., 1981; ALS
Quantity Value Units Method Reference Comment
Δcsolid-346.20 ± 0.29kcal/molCcbLebedev, Kulagina, et al., 1982see Lebedev, Kulagina, et al., 1981; Corresponding Δfsolid = -166.6 kcal/mol (simple calculation by NIST; no Washburn corrections); ALS
Quantity Value Units Method Reference Comment
solid,1 bar37.86cal/mol*KN/ALebedev, Kulagina, et al., 1982, 2DH
solid,1 bar35.78cal/mol*KN/ALebedev, Kulagina, et al., 1982, 3DH

Constant pressure heat capacity of solid

Cp,solid (cal/mol*K) Temperature (K) Reference Comment
33.91298.15Lebedev, Kulagina, et al., 1982, 2T = 8 to 330 K.; DH
33.91298.15Lebedev, Kulagina, et al., 1982, 3T = 8 to 330 K.; DH

References

Lebedev, Kulagina, et al., 1982
Lebedev, B.V.; Kulagina, T.G.; Lyudvig, Ye.B.; Ovchinnikova, T.N., Calorimetric study of ethylene oxalate,polyethylene oxalate and parameters of the polymerization of ethylene oxalate in the range 8-450 K, Vysokomol. Soedin, Ser. A, 1982, 24, 1490. [all data]

Lebedev, Kulagina, et al., 1982, 2
Lebedev, B.V.; Kulagina, T.G.; Lyudvig, Ye.B.; Ovchinnikova, T.N., Calorimetric study of ethylene oxalate, polyethylene oxalate and parameters of the polymerization of ethylene oxalate in the range 8-450 K, Vysokomol. Soedin., 1982, A24, 1490-1495. [all data]

Domalski and Hearing, 1996
Domalski, Eugene S.; Hearing, Elizabeth D., Heat Capacities and Entropies of Organic Compounds in the Condensed Phase. Volume III, J. Phys. Chem. Ref. Data, 1996, 25, 1, 1, https://doi.org/10.1063/1.555985 . [all data]