Silicon monocyanide

Gas phase ion energetics data

Data compiled by: Henry M. Rosenstock, Keith Draxl, Bruce W. Steiner, and John T. Herron

Ionization energy determinations

IE (eV) Method Reference
8.7 ± 0.5EIMuenow and Margrave, 1970

References

Muenow and Margrave, 1970
Muenow, D.W.; Margrave, J.L., Mass spectrometric determination of the heat of atomization of the molecule SiCN, J. Phys. Chem., 1970, 74, 2577. [all data]