Fluoropentanitroethane

Phase change data

Data compiled by: Hussein Y. Afeefy, Joel F. Liebman, and Stephen E. Stein

Quantity Value Units Method Reference Comment
Δsub69.0kJ/molEPepekin, Lebedev, et al., 1973

References

Pepekin, Lebedev, et al., 1973
Pepekin, V.I.; Lebedev, Yu.A.; Apin, A.Ya., Dissociation energies of C-F and C-C bonds in α-fluoronitro derivatives of methane and ethane, Dokl. Akad. Nauk SSSR, 1973, 208, 153-155. [all data]