Nitrogen atom

Gas phase thermochemistry data

Quantity Value Units Method Reference Comment
Δfgas472.68 ± 0.40kJ/molReviewCox, Wagman, et al., 1984CODATA Review value
Δfgas472.68kJ/molReviewChase, 1998Data last reviewed in December, 1982
Quantity Value Units Method Reference Comment
gas,1 bar153.301 ± 0.003J/mol*KReviewCox, Wagman, et al., 1984CODATA Review value
gas,1 bar153.28J/mol*KReviewChase, 1998Data last reviewed in December, 1982

Gas Phase Heat Capacity (Shomate Equation)

Cp° = A + B*t + C*t2 + D*t3 + E/t2
H° − H°298.15= A*t + B*t2/2 + C*t3/3 + D*t4/4 − E/t + F − H
S° = A*ln(t) + B*t + C*t2/2 + D*t3/3 − E/(2*t2) + G
    Cp = heat capacity (J/mol*K)
    H° = standard enthalpy (kJ/mol)
    S° = standard entropy (J/mol*K)
    t = temperature (K) / 1000.

View plot Requires a JavaScript / HTML 5 canvas capable browser.

View table.

Temperature (K) 298. - 6000.
A 21.13581
B -0.388842
C 0.043545
D 0.024685
E -0.025678
F 466.3110
G 178.8263
H 472.6832
ReferenceChase, 1998
Comment Data last reviewed in December, 1982

References

Cox, Wagman, et al., 1984
Cox, J.D.; Wagman, D.D.; Medvedev, V.A., CODATA Key Values for Thermodynamics, Hemisphere Publishing Corp., New York, 1984, 1. [all data]

Chase, 1998
Chase, M.W., Jr., NIST-JANAF Themochemical Tables, Fourth Edition, J. Phys. Chem. Ref. Data, Monograph 9, 1998, 1-1951. [all data]