Fluorine anion

Reaction thermochemistry data

Data compiled as indicated in comments:
B - John E. Bartmess
M - Michael M. Meot-Ner (Mautner) and Sharon G. Lias

Reactions 1 to 50

Fluorine anion + Boron trifluoride = (Fluorine anion • Boron trifluoride)

By formula: F- + BF3 = (F- • BF3)

Quantity Value Units Method Reference Comment
Δr340. ± 60.kJ/molAVGN/AAverage of 6 values; Individual data points
Quantity Value Units Method Reference Comment
Δr266. ± 8.4kJ/molIMRELarson and McMahon, 1985gas phase; These relative affinities are ca. 10 kcal/mol weaker than threshold values (see Wenthold and Squires, 1995) for donors greater than ca. 27 kcal/mol in free energy. This discrepancy has not yet been resolved, though the stronger value appears preferable.; B

Fluorine anion + Hydrogen cation = hydrogen fluoride

By formula: F- + H+ = HF

Quantity Value Units Method Reference Comment
Δr1555. ± 5.kJ/molAVGN/AAverage of 6 out of 7 values; Individual data points
Quantity Value Units Method Reference Comment
Δr1530.0 ± 0.75kJ/molH-TSBlondel, Delsart, et al., 2001gas phase; Given: 3.4011895(25) eV, or 27432.446(19) cm-1, or 78.433266(577) kcal/mol; B
Δr1529.4kJ/molH-TSMartin and Hepburn, 2000gas phase; Given: 371.334±0.003 kcal/mol (corr to 298K with data from Wagman, Evans, et al., 1982).H(0K)=370.422±0.003; B
Δr1530.0 ± 0.75kJ/molH-TSBlondel, Cacciani, et al., 1989gas phase; Reported: 3.401190±0.000004 eV. acidity includes 0.9 kcal 0 to 298 K correction.; B
Δr1529. ± 8.4kJ/molIMREBierbaum, Schmidt, et al., 1981gas phase; B
Δr1503.7kJ/molN/ACheck, Faust, et al., 2001gas phase; FeCl3-; ; ΔS(EA)=5.0; B

Fluorine anion + Sulfur dioxide = (Fluorine anion • Sulfur dioxide)

By formula: F- + O2S = (F- • O2S)

Quantity Value Units Method Reference Comment
Δr225. ± 9.2kJ/molCIDTLobring, Check, et al., 2003gas phase; B
Δr222. ± 10.kJ/molCIDTSquires, 1992gas phase; B
Δr183.kJ/molICRLarson and McMahon, 1985gas phase; switching reaction(F-)H2O, Entropy change calculated or estimated; Arshadi, Yamdagni, et al., 1970; M
Δr183. ± 8.4kJ/molIMRELarson and McMahon, 1983gas phase; These relative affinities are ca. 10 kcal/mol weaker than threshold values (see Wenthold and Squires, 1995) for donors greater than ca. 27 kcal/mol in free energy. This discrepancy has not yet been resolved, though the stronger value appears preferable.; B,M
Δr250.kJ/molSAMSRobbiani and Franklin, 1979gas phase; Cl- + CO2ClF --> SO2F- + Cl2, ΔrH>; M
Quantity Value Units Method Reference Comment
Δr100.J/mol*KN/ALarson and McMahon, 1985gas phase; switching reaction(F-)H2O, Entropy change calculated or estimated; Arshadi, Yamdagni, et al., 1970; M
Δr96.2J/mol*KN/ALarson and McMahon, 1983gas phase; switching reaction(F-)H2O, Entropy change calculated or estimated; Arshadi, Yamdagni, et al., 1970; M
Quantity Value Units Method Reference Comment
Δr153.kJ/molICRLarson and McMahon, 1985gas phase; switching reaction(F-)H2O, Entropy change calculated or estimated; Arshadi, Yamdagni, et al., 1970; M
Δr154. ± 8.4kJ/molIMRELarson and McMahon, 1983gas phase; These relative affinities are ca. 10 kcal/mol weaker than threshold values (see Wenthold and Squires, 1995) for donors greater than ca. 27 kcal/mol in free energy. This discrepancy has not yet been resolved, though the stronger value appears preferable.; B,M

Fluorine anion + Thionyl fluoride = (Fluorine anion • Thionyl fluoride)

By formula: F- + F2OS = (F- • F2OS)

Quantity Value Units Method Reference Comment
Δr150.kJ/molICRLarson and McMahon, 1985gas phase; switching reaction,Thermochemical ladder(F-)H2O, Entropy change calculated or estimated; Arshadi, Yamdagni, et al., 1970; M
Δr156.kJ/molICRLarson and McMahon, 1985gas phase; switching reaction,Thermochemical ladder(F-)H2O, Entropy change calculated or estimated; Arshadi, Yamdagni, et al., 1970; M
Δr156. ± 8.4kJ/molIMRELarson and McMahon, 1983gas phase; These relative affinities are ca. 10 kcal/mol weaker than threshold values (see Wenthold and Squires, 1995) for donors greater than ca. 27 kcal/mol in free energy. This discrepancy has not yet been resolved, though the stronger value appears preferable.; B,M
Quantity Value Units Method Reference Comment
Δr101.J/mol*KN/ALarson and McMahon, 1983gas phase; switching reaction(F-)H2O, Entropy change calculated or estimated; Arshadi, Yamdagni, et al., 1970; M
Quantity Value Units Method Reference Comment
Δr126.kJ/molICRLarson and McMahon, 1985gas phase; switching reaction,Thermochemical ladder(F-)H2O, Entropy change calculated or estimated; Arshadi, Yamdagni, et al., 1970; M
Δr126. ± 8.4kJ/molIMRELarson and McMahon, 1983gas phase; These relative affinities are ca. 10 kcal/mol weaker than threshold values (see Wenthold and Squires, 1995) for donors greater than ca. 27 kcal/mol in free energy. This discrepancy has not yet been resolved, though the stronger value appears preferable.; B,M

Free energy of reaction

ΔrG° (kJ/mol) T (K) Method Reference Comment
115.2988.ICRLarson and McMahon, 1985gas phase; switching reaction,Thermochemical ladder(F-)H2O, Entropy change calculated or estimated; Arshadi, Yamdagni, et al., 1970; M

Fluorine anion + Phosphorus trifluoride = (Fluorine anion • Phosphorus trifluoride)

By formula: F- + F3P = (F- • F3P)

Quantity Value Units Method Reference Comment
Δr168.kJ/molICRLarson and McMahon, 1985gas phase; switching reaction,Thermochemical ladder(F-)H2O, Entropy change calculated or estimated; Arshadi, Yamdagni, et al., 1970; M
Δr168. ± 8.4kJ/molIMRELarson and McMahon, 1983gas phase; These relative affinities are ca. 10 kcal/mol weaker than threshold values (see Wenthold and Squires, 1995) for donors greater than ca. 27 kcal/mol in free energy. This discrepancy has not yet been resolved, though the stronger value appears preferable.; B,M
Δr209. ± 21.kJ/molIMRBSullivan and Beauchamp, 1978gas phase; Fluoride Affinity: < OPF3, > F, SF4, Me3SiF, HCN, SO2; B
Quantity Value Units Method Reference Comment
Δr100.J/mol*KN/ALarson and McMahon, 1985gas phase; switching reaction,Thermochemical ladder(F-)H2O, Entropy change calculated or estimated; Arshadi, Yamdagni, et al., 1970; M
Δr107.J/mol*KN/ALarson and McMahon, 1983gas phase; switching reaction(F-)H2O, Entropy change calculated or estimated; Arshadi, Yamdagni, et al., 1970; M
Quantity Value Units Method Reference Comment
Δr136.kJ/molICRLarson and McMahon, 1985gas phase; switching reaction,Thermochemical ladder(F-)H2O, Entropy change calculated or estimated; Arshadi, Yamdagni, et al., 1970; M
Δr136. ± 8.4kJ/molIMRELarson and McMahon, 1983gas phase; These relative affinities are ca. 10 kcal/mol weaker than threshold values (see Wenthold and Squires, 1995) for donors greater than ca. 27 kcal/mol in free energy. This discrepancy has not yet been resolved, though the stronger value appears preferable.; B,M

Fluorine anion + hydrogen fluoride = (Fluorine anion • hydrogen fluoride)

By formula: F- + HF = (F- • HF)

Bond type: Hydrogen bond (negative ion to hydride)

Quantity Value Units Method Reference Comment
Δr192. ± 6.7kJ/molCIDCWenthold and Squires, 1995gas phase; B
Δr162. ± 8.4kJ/molIMRELarson and McMahon, 1983gas phase; These relative affinities are ca. 10 kcal/mol weaker than threshold values (see Wenthold and Squires, 1995) for donors greater than ca. 27 kcal/mol in free energy. This discrepancy has not yet been resolved, though the stronger value appears preferable.; B,M
Δr>145. ± 19.kJ/molTherHeni and Illenberger, 1985gas phase; From CHF=CHF. Outdataed HC2. thermo used. Current value ( Berkowitz, Ellison, et al., 1994) implies Haff>57.; B
Quantity Value Units Method Reference Comment
Δr91.6J/mol*KN/ALarson and McMahon, 1983gas phase; switching reaction,Thermochemical ladder(F-)H2O, Entropy change calculated or estimated; Arshadi, Yamdagni, et al., 1970; M
Quantity Value Units Method Reference Comment
Δr134. ± 8.4kJ/molIMRELarson and McMahon, 1983gas phase; These relative affinities are ca. 10 kcal/mol weaker than threshold values (see Wenthold and Squires, 1995) for donors greater than ca. 27 kcal/mol in free energy. This discrepancy has not yet been resolved, though the stronger value appears preferable.; B

Free energy of reaction

ΔrG° (kJ/mol) T (K) Method Reference Comment
134.289.ICRLarson and McMahon, 1983gas phase; switching reaction,Thermochemical ladder(F-)H2O, Entropy change calculated or estimated; Arshadi, Yamdagni, et al., 1970; M

Fluorine anion + Aluminum fluoride = (Fluorine anion • Aluminum fluoride)

By formula: F- + AlF3 = (F- • AlF3)

Quantity Value Units Method Reference Comment
Δr510. ± 90.kJ/molAVGN/AAverage of 7 values; Individual data points

Fluorine anion + F4U = (Fluorine anion • F4U)

By formula: F- + F4U = (F- • F4U)

Quantity Value Units Method Reference Comment
Δr420. ± 20.kJ/molAVGN/AAverage of 6 values; Individual data points

Fluorine anion + Phosphorus pentafluoride = (Fluorine anion • Phosphorus pentafluoride)

By formula: F- + F5P = (F- • F5P)

Quantity Value Units Method Reference Comment
Δr329. ± 14.kJ/molTDAsAleshina, Borshchevskii, et al., 1996gas phase; The discrepancy with Larson and McMahon, 1985 is discussed but not resolved.; value altered from reference due to conversion from electron convention to ion convention; B
Δr360. ± 42.kJ/molIMRELarson and McMahon, 1985gas phase; These relative affinities are ca. 10 kcal/mol weaker than threshold values (see Wenthold and Squires, 1995) for donors greater than ca. 27 kcal/mol in free energy. This discrepancy has not yet been resolved, though the stronger value appears preferable.; B,M
Δr423. ± 33.kJ/molTherMallouk, Rosenthal, et al., 1984gas phase; Fluoride affinities from this method appear to be consistently about 10 kcal/mol too bound; B
Quantity Value Units Method Reference Comment
Δr310. ± 42.kJ/molIMRELarson and McMahon, 1985gas phase; These relative affinities are ca. 10 kcal/mol weaker than threshold values (see Wenthold and Squires, 1995) for donors greater than ca. 27 kcal/mol in free energy. This discrepancy has not yet been resolved, though the stronger value appears preferable.; B

Fluorine anion + Carbonic difluoride = (Fluorine anion • Carbonic difluoride)

By formula: F- + CF2O = (F- • CF2O)

Quantity Value Units Method Reference Comment
Δr178.kJ/molICRLarson and McMahon, 1985gas phase; switching reaction,Thermochemical ladder(F-)H2O, Entropy change calculated or estimated; Arshadi, Yamdagni, et al., 1970; M
Δr178.kJ/molICRLarson and McMahon, 1983gas phase; switching reaction(F-)H2O, Entropy change calculated or estimated; Arshadi, Yamdagni, et al., 1970; M
Quantity Value Units Method Reference Comment
Δr120.J/mol*KN/ALarson and McMahon, 1985gas phase; switching reaction,Thermochemical ladder(F-)H2O, Entropy change calculated or estimated; Arshadi, Yamdagni, et al., 1970; M
Δr121.J/mol*KN/ALarson and McMahon, 1983gas phase; switching reaction(F-)H2O, Entropy change calculated or estimated; Arshadi, Yamdagni, et al., 1970; M
Quantity Value Units Method Reference Comment
Δr142.kJ/molICRLarson and McMahon, 1985gas phase; switching reaction,Thermochemical ladder(F-)H2O, Entropy change calculated or estimated; Arshadi, Yamdagni, et al., 1970; M
Δr142.kJ/molICRLarson and McMahon, 1984gas phase; switching reaction(F-)PF3; M
Δr142.kJ/molICRLarson and McMahon, 1983gas phase; switching reaction(F-)H2O, Entropy change calculated or estimated; Arshadi, Yamdagni, et al., 1970; M

Fluorine anion + Phosphoryl fluoride = (Fluorine anion • Phosphoryl fluoride)

By formula: F- + F3OP = (F- • F3OP)

Quantity Value Units Method Reference Comment
Δr200. ± 8.4kJ/molIMRELarson and McMahon, 1985gas phase; These relative affinities are ca. 10 kcal/mol weaker than threshold values (see Wenthold and Squires, 1995) for donors greater than ca. 27 kcal/mol in free energy. This discrepancy has not yet been resolved, though the stronger value appears preferable.; B,M
Δr201. ± 38.kJ/molIMRBRhyne and Dillard, 1971gas phase; Fluoride Affinity: SF4>F3PO>SF5. Orignal value 32±10, now reval. with new affinities; B
Quantity Value Units Method Reference Comment
Δr110.J/mol*KN/ALarson and McMahon, 1985gas phase; switching reaction,Thermochemical ladder(F-)H2O, Entropy change calculated or estimated; Arshadi, Yamdagni, et al., 1970; M
Quantity Value Units Method Reference Comment
Δr168. ± 8.4kJ/molIMRELarson and McMahon, 1985gas phase; These relative affinities are ca. 10 kcal/mol weaker than threshold values (see Wenthold and Squires, 1995) for donors greater than ca. 27 kcal/mol in free energy. This discrepancy has not yet been resolved, though the stronger value appears preferable.; B,M

Fluorine anion + Sulfur tetrafluoride = (Fluorine anion • Sulfur tetrafluoride)

By formula: F- + F4S = (F- • F4S)

Quantity Value Units Method Reference Comment
Δr183.kJ/molICRLarson and McMahon, 1985gas phase; switching reaction,Thermochemical ladder(F-)H2O, Entropy change calculated or estimated; Arshadi, Yamdagni, et al., 1970; M
Δr183.kJ/molICRLarson and McMahon, 1983gas phase; switching reaction(F-)H2O, Entropy change calculated or estimated; Arshadi, Yamdagni, et al., 1970; M
Quantity Value Units Method Reference Comment
Δr100.J/mol*KN/ALarson and McMahon, 1985gas phase; switching reaction,Thermochemical ladder(F-)H2O, Entropy change calculated or estimated; Arshadi, Yamdagni, et al., 1970; M
Δr107.J/mol*KN/ALarson and McMahon, 1983gas phase; switching reaction(F-)H2O, Entropy change calculated or estimated; Arshadi, Yamdagni, et al., 1970; M
Quantity Value Units Method Reference Comment
Δr151.kJ/molICRLarson and McMahon, 1985gas phase; switching reaction,Thermochemical ladder(F-)H2O, Entropy change calculated or estimated; Arshadi, Yamdagni, et al., 1970; M
Δr151.kJ/molICRLarson and McMahon, 1983gas phase; switching reaction(F-)H2O, Entropy change calculated or estimated; Arshadi, Yamdagni, et al., 1970; M

Fluorine anion + Silicon tetrafluoride = (Fluorine anion • Silicon tetrafluoride)

By formula: F- + F4Si = (F- • F4Si)

Quantity Value Units Method Reference Comment
Δr>121.8 ± 2.1kJ/molN/AKawamata, Neigishi, et al., 1996gas phase; B
Δr285. ± 21.kJ/molIMRBMurphy and Beauchamp, 1977gas phase; Fluoride Affinity: <BF3, >iPr2BF; B
Δr251. ± 17.kJ/molIMRELarson and McMahon, 1985gas phase; These relative affinities are ca. 10 kcal/mol weaker than threshold values (see Wenthold and Squires, 1995) for donors greater than ca. 27 kcal/mol in free energy. This discrepancy has not yet been resolved, though the stronger value appears preferable.; B,M
Quantity Value Units Method Reference Comment
Δr226. ± 17.kJ/molIMRELarson and McMahon, 1985gas phase; These relative affinities are ca. 10 kcal/mol weaker than threshold values (see Wenthold and Squires, 1995) for donors greater than ca. 27 kcal/mol in free energy. This discrepancy has not yet been resolved, though the stronger value appears preferable.; B
Δr210.kJ/molICRLarson and McMahon, 1984gas phase; switching reaction(F-)H2O, DG+-8. kJ/mol; 70 ARS/YAM; M

(Fluorine anion • 4294967295Sulfur tetrafluoride) + Sulfur tetrafluoride = Fluorine anion

By formula: (F- • 4294967295F4S) + F4S = F-

Quantity Value Units Method Reference Comment
Δr230. ± 9.6kJ/molCIDTLobring, Check, et al., 2003, 2gas phase; B
Δr226. ± 27.kJ/molTherLeffert, Tang, et al., 1974gas phase; From SF6; B
Δr>169. ± 14.kJ/molIMRBBabcock and Streit, 1981gas phase; Fluoride Affinity: SF4 > SF5; B
Δr183. ± 8.4kJ/molIMRELarson and McMahon, 1983gas phase; These relative affinities are ca. 10 kcal/mol weaker than threshold values (see Wenthold and Squires, 1995) for donors greater than ca. 27 kcal/mol in free energy. This discrepancy has not yet been resolved, though the stronger value appears preferable.; B
Quantity Value Units Method Reference Comment
Δr151. ± 8.4kJ/molIMRELarson and McMahon, 1983gas phase; These relative affinities are ca. 10 kcal/mol weaker than threshold values (see Wenthold and Squires, 1995) for donors greater than ca. 27 kcal/mol in free energy. This discrepancy has not yet been resolved, though the stronger value appears preferable.; B

Fluorine anion + C3F6O = (Fluorine anion • C3F6O)

By formula: F- + C3F6O = (F- • C3F6O)

Quantity Value Units Method Reference Comment
Δr197. ± 8.4kJ/molIMRELarson and McMahon, 1985gas phase; These relative affinities are ca. 10 kcal/mol weaker than threshold values (see Wenthold and Squires, 1995) for donors greater than ca. 27 kcal/mol in free energy. This discrepancy has not yet been resolved, though the stronger value appears preferable.; B,M
Quantity Value Units Method Reference Comment
Δr120.J/mol*KN/ALarson and McMahon, 1985gas phase; switching reaction,Thermochemical ladder(F-)H2O, Entropy change calculated or estimated; Arshadi, Yamdagni, et al., 1970; M
Quantity Value Units Method Reference Comment
Δr162. ± 8.4kJ/molIMRELarson and McMahon, 1985gas phase; These relative affinities are ca. 10 kcal/mol weaker than threshold values (see Wenthold and Squires, 1995) for donors greater than ca. 27 kcal/mol in free energy. This discrepancy has not yet been resolved, though the stronger value appears preferable.; B,M
Δr162.kJ/molICRLarson and McMahon, 1984gas phase; switching reaction(F-)CF3COF; M

Fluorine anion + Borane, trimethyl- = (Fluorine anion • Borane, trimethyl-)

By formula: F- + C3H9B = (F- • C3H9B)

Quantity Value Units Method Reference Comment
Δr244.8kJ/molIMRBMurphy and Beauchamp, 1977, 2gas phase; MeSiF3>Me3B>SF4; B
Δr197. ± 8.4kJ/molIMRELarson and McMahon, 1985gas phase; These relative affinities are ca. 10 kcal/mol weaker than threshold values (see Wenthold and Squires, 1995) for donors greater than ca. 27 kcal/mol in free energy. This discrepancy has not yet been resolved, though the stronger value appears preferable.; B,M
Quantity Value Units Method Reference Comment
Δr100.J/mol*KN/ALarson and McMahon, 1985gas phase; switching reaction,Thermochemical ladder(F-)H2O, Entropy change calculated or estimated; Arshadi, Yamdagni, et al., 1970; M
Quantity Value Units Method Reference Comment
Δr166. ± 8.4kJ/molIMRELarson and McMahon, 1985gas phase; These relative affinities are ca. 10 kcal/mol weaker than threshold values (see Wenthold and Squires, 1995) for donors greater than ca. 27 kcal/mol in free energy. This discrepancy has not yet been resolved, though the stronger value appears preferable.; B,M

Fluorine anion + Borane, triethyl- = (Fluorine anion • Borane, triethyl-)

By formula: F- + C6H15B = (F- • C6H15B)

Quantity Value Units Method Reference Comment
Δr259.4kJ/molIMRBMurphy and Beauchamp, 1977, 2gas phase; iPr3B>Et3B>MeSiF3; B
Δr213. ± 8.4kJ/molIMRELarson and McMahon, 1985gas phase; These relative affinities are ca. 10 kcal/mol weaker than threshold values (see Wenthold and Squires, 1995) for donors greater than ca. 27 kcal/mol in free energy. This discrepancy has not yet been resolved, though the stronger value appears preferable.; B,M
Quantity Value Units Method Reference Comment
Δr100.J/mol*KN/ALarson and McMahon, 1985gas phase; switching reaction,Thermochemical ladder(F-)H2O, Entropy change calculated or estimated; Arshadi, Yamdagni, et al., 1970; M
Quantity Value Units Method Reference Comment
Δr182. ± 8.4kJ/molIMRELarson and McMahon, 1985gas phase; These relative affinities are ca. 10 kcal/mol weaker than threshold values (see Wenthold and Squires, 1995) for donors greater than ca. 27 kcal/mol in free energy. This discrepancy has not yet been resolved, though the stronger value appears preferable.; B,M

Fluorine anion + Trimethylsilyl fluoride = (Fluorine anion • Trimethylsilyl fluoride)

By formula: F- + C3H9FSi = (F- • C3H9FSi)

Quantity Value Units Method Reference Comment
Δr160. ± 8.4kJ/molIMRELarson and McMahon, 1985gas phase; These relative affinities are ca. 10 kcal/mol weaker than threshold values (see Wenthold and Squires, 1995) for donors greater than ca. 27 kcal/mol in free energy. This discrepancy has not yet been resolved, though the stronger value appears preferable.; B,M
Δr<230. ± 42.kJ/molIMRBMurphy and Beauchamp, 1977gas phase; B
Quantity Value Units Method Reference Comment
Δr92.J/mol*KN/ALarson and McMahon, 1985gas phase; switching reaction,Thermochemical ladder(F-)H2O, Entropy change calculated or estimated; Arshadi, Yamdagni, et al., 1970; M
Quantity Value Units Method Reference Comment
Δr132. ± 8.4kJ/molIMRELarson and McMahon, 1985gas phase; These relative affinities are ca. 10 kcal/mol weaker than threshold values (see Wenthold and Squires, 1995) for donors greater than ca. 27 kcal/mol in free energy. This discrepancy has not yet been resolved, though the stronger value appears preferable.; B,M

Fluorine anion + 1,1,1',1'-Tetrafluorodimethyl ether = (Fluorine anion • 1,1,1',1'-Tetrafluorodimethyl ether)

By formula: F- + C2H2F4O = (F- • C2H2F4O)

Quantity Value Units Method Reference Comment
Δr151. ± 8.4kJ/molIMRELarson and McMahon, 1983gas phase; These relative affinities are ca. 10 kcal/mol weaker than threshold values (see Wenthold and Squires, 1995) for donors greater than ca. 27 kcal/mol in free energy. This discrepancy has not yet been resolved, though the stronger value appears preferable.; B,M
Quantity Value Units Method Reference Comment
Δr114.J/mol*KN/ALarson and McMahon, 1983gas phase; switching reaction(F-)H2O, Entropy change calculated or estimated; Arshadi, Yamdagni, et al., 1970; M
Quantity Value Units Method Reference Comment
Δr118.kJ/molICRLarson and McMahon, 1984gas phase; switching reaction(F-)SO2F2; M
Δr117. ± 8.4kJ/molIMRELarson and McMahon, 1983gas phase; These relative affinities are ca. 10 kcal/mol weaker than threshold values (see Wenthold and Squires, 1995) for donors greater than ca. 27 kcal/mol in free energy. This discrepancy has not yet been resolved, though the stronger value appears preferable.; B,M

Fluorine anion + Silane, trifluoromethyl- = (Fluorine anion • Silane, trifluoromethyl-)

By formula: F- + CH3F3Si = (F- • CH3F3Si)

Quantity Value Units Method Reference Comment
Δr257. ± 21.kJ/molIMRBMurphy and Beauchamp, 1977gas phase; B
Δr211. ± 8.4kJ/molIMRELarson and McMahon, 1985gas phase; These relative affinities are ca. 10 kcal/mol weaker than threshold values (see Wenthold and Squires, 1995) for donors greater than ca. 27 kcal/mol in free energy. This discrepancy has not yet been resolved, though the stronger value appears preferable.; B,M
Quantity Value Units Method Reference Comment
Δr100.J/mol*KN/ALarson and McMahon, 1985gas phase; switching reaction,Thermochemical ladder(F-)H2O, Entropy change calculated or estimated; Arshadi, Yamdagni, et al., 1970; M
Quantity Value Units Method Reference Comment
Δr180. ± 8.4kJ/molIMRELarson and McMahon, 1985gas phase; These relative affinities are ca. 10 kcal/mol weaker than threshold values (see Wenthold and Squires, 1995) for donors greater than ca. 27 kcal/mol in free energy. This discrepancy has not yet been resolved, though the stronger value appears preferable.; B,M

Fluorine anion + Sulfuryl fluoride = (Fluorine anion • Sulfuryl fluoride)

By formula: F- + F2O2S = (F- • F2O2S)

Quantity Value Units Method Reference Comment
Δr150. ± 8.4kJ/molIMRELarson and McMahon, 1983gas phase; These relative affinities are ca. 10 kcal/mol weaker than threshold values (see Wenthold and Squires, 1995) for donors greater than ca. 27 kcal/mol in free energy. This discrepancy has not yet been resolved, though the stronger value appears preferable.; B,M
Δr126. ± 25.kJ/molTherGalembeck, Faigle, et al., 1978gas phase; B
Quantity Value Units Method Reference Comment
Δr115.J/mol*KN/ALarson and McMahon, 1983gas phase; switching reaction(F-)H2O, Entropy change calculated or estimated; Arshadi, Yamdagni, et al., 1970; M
Quantity Value Units Method Reference Comment
Δr115. ± 8.4kJ/molIMRELarson and McMahon, 1983gas phase; These relative affinities are ca. 10 kcal/mol weaker than threshold values (see Wenthold and Squires, 1995) for donors greater than ca. 27 kcal/mol in free energy. This discrepancy has not yet been resolved, though the stronger value appears preferable.; B,M

Fluorine anion + Hydrogen sulfide = (Fluorine anion • Hydrogen sulfide)

By formula: F- + H2S = (F- • H2S)

Bond type: Hydrogen bond (negative ion to hydride)

Quantity Value Units Method Reference Comment
Δr145. ± 8.4kJ/molIMRELarson and McMahon, 1983gas phase; These relative affinities are ca. 10 kcal/mol weaker than threshold values (see Wenthold and Squires, 1995) for donors greater than ca. 27 kcal/mol in free energy. This discrepancy has not yet been resolved, though the stronger value appears preferable.; B,M
Quantity Value Units Method Reference Comment
Δr78.7J/mol*KN/ALarson and McMahon, 1983gas phase; switching reaction(F-)H2O, Entropy change calculated or estimated; Arshadi, Yamdagni, et al., 1970; M
Quantity Value Units Method Reference Comment
Δr121. ± 8.4kJ/molIMRELarson and McMahon, 1983gas phase; These relative affinities are ca. 10 kcal/mol weaker than threshold values (see Wenthold and Squires, 1995) for donors greater than ca. 27 kcal/mol in free energy. This discrepancy has not yet been resolved, though the stronger value appears preferable.; B,M

Fluorine anion + trifluoroarsine = (Fluorine anion • trifluoroarsine)

By formula: F- + AsF3 = (F- • AsF3)

Quantity Value Units Method Reference Comment
Δr202. ± 8.4kJ/molIMRELarson and McMahon, 1985gas phase; These relative affinities are ca. 10 kcal/mol weaker than threshold values (see Wenthold and Squires, 1995) for donors greater than ca. 27 kcal/mol in free energy. This discrepancy has not yet been resolved, though the stronger value appears preferable.; B,M
Quantity Value Units Method Reference Comment
Δr100.J/mol*KN/ALarson and McMahon, 1985gas phase; switching reaction,Thermochemical ladder(F-)H2O, Entropy change calculated or estimated; Arshadi, Yamdagni, et al., 1970; M
Quantity Value Units Method Reference Comment
Δr172. ± 8.4kJ/molIMRELarson and McMahon, 1985gas phase; These relative affinities are ca. 10 kcal/mol weaker than threshold values (see Wenthold and Squires, 1995) for donors greater than ca. 27 kcal/mol in free energy. This discrepancy has not yet been resolved, though the stronger value appears preferable.; B,M

Fluorine anion + C2F4O = (Fluorine anion • C2F4O)

By formula: F- + C2F4O = (F- • C2F4O)

Quantity Value Units Method Reference Comment
Δr191. ± 8.4kJ/molIMRELarson and McMahon, 1985gas phase; These relative affinities are ca. 10 kcal/mol weaker than threshold values (see Wenthold and Squires, 1995) for donors greater than ca. 27 kcal/mol in free energy. This discrepancy has not yet been resolved, though the stronger value appears preferable.; B,M
Quantity Value Units Method Reference Comment
Δr120.J/mol*KN/ALarson and McMahon, 1985gas phase; switching reaction,Thermochemical ladder(F-)H2O, Entropy change calculated or estimated; Arshadi, Yamdagni, et al., 1970; M
Quantity Value Units Method Reference Comment
Δr156. ± 8.4kJ/molIMRELarson and McMahon, 1985gas phase; These relative affinities are ca. 10 kcal/mol weaker than threshold values (see Wenthold and Squires, 1995) for donors greater than ca. 27 kcal/mol in free energy. This discrepancy has not yet been resolved, though the stronger value appears preferable.; B,M

Fluorine anion + C2F2O2 = (Fluorine anion • C2F2O2)

By formula: F- + C2F2O2 = (F- • C2F2O2)

Quantity Value Units Method Reference Comment
Δr191. ± 8.4kJ/molIMRELarson and McMahon, 1985gas phase; These relative affinities are ca. 10 kcal/mol weaker than threshold values (see Wenthold and Squires, 1995) for donors greater than ca. 27 kcal/mol in free energy. This discrepancy has not yet been resolved, though the stronger value appears preferable.; B,M
Quantity Value Units Method Reference Comment
Δr120.J/mol*KN/ALarson and McMahon, 1985gas phase; switching reaction,Thermochemical ladder(F-)H2O, Entropy change calculated or estimated; Arshadi, Yamdagni, et al., 1970; M
Quantity Value Units Method Reference Comment
Δr155. ± 8.4kJ/molIMRELarson and McMahon, 1985gas phase; These relative affinities are ca. 10 kcal/mol weaker than threshold values (see Wenthold and Squires, 1995) for donors greater than ca. 27 kcal/mol in free energy. This discrepancy has not yet been resolved, though the stronger value appears preferable.; B,M

Fluorine anion + 2-Propanone, 1,1,1,3,3,3-hexafluoro- = (Fluorine anion • 2-Propanone, 1,1,1,3,3,3-hexafluoro-)

By formula: F- + C3F6O = (F- • C3F6O)

Quantity Value Units Method Reference Comment
Δr208. ± 8.4kJ/molIMRELarson and McMahon, 1985gas phase; These relative affinities are ca. 10 kcal/mol weaker than threshold values (see Wenthold and Squires, 1995) for donors greater than ca. 27 kcal/mol in free energy. This discrepancy has not yet been resolved, though the stronger value appears preferable.; B,M
Quantity Value Units Method Reference Comment
Δr110.J/mol*KN/ALarson and McMahon, 1985gas phase; switching reaction,Thermochemical ladder(F-)H2O, Entropy change calculated or estimated; Arshadi, Yamdagni, et al., 1970; M
Quantity Value Units Method Reference Comment
Δr174. ± 8.4kJ/molIMRELarson and McMahon, 1985gas phase; These relative affinities are ca. 10 kcal/mol weaker than threshold values (see Wenthold and Squires, 1995) for donors greater than ca. 27 kcal/mol in free energy. This discrepancy has not yet been resolved, though the stronger value appears preferable.; B,M

Fluorine anion + C3F5N = (Fluorine anion • C3F5N)

By formula: F- + C3F5N = (F- • C3F5N)

Quantity Value Units Method Reference Comment
Δr126. ± 8.4kJ/molIMRELarson and McMahon, 1983gas phase; B,M
Δr127.kJ/molICRLarson and McMahon, 1985gas phase; switching reaction,Thermochemical ladder(F-)H2O, Entropy change calculated or estimated; Arshadi, Yamdagni, et al., 1970; M
Quantity Value Units Method Reference Comment
Δr100.J/mol*KN/ALarson and McMahon, 1985gas phase; switching reaction,Thermochemical ladder(F-)H2O, Entropy change calculated or estimated; Arshadi, Yamdagni, et al., 1970; M
Δr95.4J/mol*KN/ALarson and McMahon, 1983gas phase; switching reaction(F-)H2O, Entropy change calculated or estimated; Arshadi, Yamdagni, et al., 1970; M
Quantity Value Units Method Reference Comment
Δr97.5 ± 8.4kJ/molIMRELarson and McMahon, 1983gas phase; B,M
Δr96.7kJ/molICRLarson and McMahon, 1985gas phase; switching reaction,Thermochemical ladder(F-)H2O, Entropy change calculated or estimated; Arshadi, Yamdagni, et al., 1970; M

Fluorine anion + Phenol = (Fluorine anion • Phenol)

By formula: F- + C6H6O = (F- • C6H6O)

Quantity Value Units Method Reference Comment
Δr173. ± 8.4kJ/molIMRELarson and McMahon, 1983gas phase; These relative affinities are ca. 10 kcal/mol weaker than threshold values (see Wenthold and Squires, 1995) for donors greater than ca. 27 kcal/mol in free energy. This discrepancy has not yet been resolved, though the stronger value appears preferable.; B,M
Quantity Value Units Method Reference Comment
Δr110.J/mol*KN/ALarson and McMahon, 1983gas phase; switching reaction(F-)H2O, Entropy change calculated or estimated; Arshadi, Yamdagni, et al., 1970; M
Quantity Value Units Method Reference Comment
Δr140. ± 8.4kJ/molIMRELarson and McMahon, 1983gas phase; These relative affinities are ca. 10 kcal/mol weaker than threshold values (see Wenthold and Squires, 1995) for donors greater than ca. 27 kcal/mol in free energy. This discrepancy has not yet been resolved, though the stronger value appears preferable.; B,M

Fluorine anion + Ethanol, 2-fluoro- = (Fluorine anion • Ethanol, 2-fluoro-)

By formula: F- + C2H5FO = (F- • C2H5FO)

Quantity Value Units Method Reference Comment
Δr146. ± 8.4kJ/molIMRELarson and McMahon, 1983gas phase; These relative affinities are ca. 10 kcal/mol weaker than threshold values (see Wenthold and Squires, 1995) for donors greater than ca. 27 kcal/mol in free energy. This discrepancy has not yet been resolved, though the stronger value appears preferable.; B,M
Quantity Value Units Method Reference Comment
Δr110.J/mol*KN/ALarson and McMahon, 1983gas phase; switching reaction(F-)H2O, Entropy change calculated or estimated; Arshadi, Yamdagni, et al., 1970; M
Quantity Value Units Method Reference Comment
Δr113. ± 8.4kJ/molIMRELarson and McMahon, 1983gas phase; These relative affinities are ca. 10 kcal/mol weaker than threshold values (see Wenthold and Squires, 1995) for donors greater than ca. 27 kcal/mol in free energy. This discrepancy has not yet been resolved, though the stronger value appears preferable.; B,M

Fluorine anion + Formic acid = (Fluorine anion • Formic acid)

By formula: F- + CH2O2 = (F- • CH2O2)

Quantity Value Units Method Reference Comment
Δr190. ± 8.4kJ/molIMRELarson and McMahon, 1983gas phase; These relative affinities are ca. 10 kcal/mol weaker than threshold values (see Wenthold and Squires, 1995) for donors greater than ca. 27 kcal/mol in free energy. This discrepancy has not yet been resolved, though the stronger value appears preferable.; B,M
Quantity Value Units Method Reference Comment
Δr101.J/mol*KN/ALarson and McMahon, 1983gas phase; switching reaction(F-)H2O, Entropy change calculated or estimated; Arshadi, Yamdagni, et al., 1970; M
Quantity Value Units Method Reference Comment
Δr159. ± 8.4kJ/molIMRELarson and McMahon, 1983gas phase; These relative affinities are ca. 10 kcal/mol weaker than threshold values (see Wenthold and Squires, 1995) for donors greater than ca. 27 kcal/mol in free energy. This discrepancy has not yet been resolved, though the stronger value appears preferable.; B,M

Fluorine anion + Acetic acid = (Fluorine anion • Acetic acid)

By formula: F- + C2H4O2 = (F- • C2H4O2)

Quantity Value Units Method Reference Comment
Δr185. ± 8.4kJ/molIMRELarson and McMahon, 1983gas phase; These relative affinities are ca. 10 kcal/mol weaker than threshold values (see Wenthold and Squires, 1995) for donors greater than ca. 27 kcal/mol in free energy. This discrepancy has not yet been resolved, though the stronger value appears preferable.; B,M
Quantity Value Units Method Reference Comment
Δr107.J/mol*KN/ALarson and McMahon, 1983gas phase; switching reaction(F-)H2O, Entropy change calculated or estimated; Arshadi, Yamdagni, et al., 1970; M
Quantity Value Units Method Reference Comment
Δr153. ± 8.4kJ/molIMRELarson and McMahon, 1983gas phase; These relative affinities are ca. 10 kcal/mol weaker than threshold values (see Wenthold and Squires, 1995) for donors greater than ca. 27 kcal/mol in free energy. This discrepancy has not yet been resolved, though the stronger value appears preferable.; B,M

Fluorine anion + Hydrogen cyanide = (Fluorine anion • Hydrogen cyanide)

By formula: F- + CHN = (F- • CHN)

Quantity Value Units Method Reference Comment
Δr165. ± 8.4kJ/molIMRELarson and McMahon, 1983gas phase; These relative affinities are ca. 10 kcal/mol weaker than threshold values (see Wenthold and Squires, 1995) for donors greater than ca. 27 kcal/mol in free energy. This discrepancy has not yet been resolved, though the stronger value appears preferable.; B,M
Quantity Value Units Method Reference Comment
Δr92.9J/mol*KN/ALarson and McMahon, 1983gas phase; switching reaction(F-)H2O, Entropy change calculated or estimated; Arshadi, Yamdagni, et al., 1970; M
Quantity Value Units Method Reference Comment
Δr138. ± 8.4kJ/molIMRELarson and McMahon, 1983gas phase; These relative affinities are ca. 10 kcal/mol weaker than threshold values (see Wenthold and Squires, 1995) for donors greater than ca. 27 kcal/mol in free energy. This discrepancy has not yet been resolved, though the stronger value appears preferable.; B,M

Fluorine anion + Methanethiol = (Fluorine anion • Methanethiol)

By formula: F- + CH4S = (F- • CH4S)

Quantity Value Units Method Reference Comment
Δr143. ± 8.4kJ/molIMRELarson and McMahon, 1983gas phase; These relative affinities are ca. 10 kcal/mol weaker than threshold values (see Wenthold and Squires, 1995) for donors greater than ca. 27 kcal/mol in free energy. This discrepancy has not yet been resolved, though the stronger value appears preferable.; B,M
Quantity Value Units Method Reference Comment
Δr97.1J/mol*KN/ALarson and McMahon, 1983gas phase; switching reaction(F-)H2O, Entropy change calculated or estimated; Arshadi, Yamdagni, et al., 1970; M
Quantity Value Units Method Reference Comment
Δr114. ± 8.4kJ/molIMRELarson and McMahon, 1983gas phase; These relative affinities are ca. 10 kcal/mol weaker than threshold values (see Wenthold and Squires, 1995) for donors greater than ca. 27 kcal/mol in free energy. This discrepancy has not yet been resolved, though the stronger value appears preferable.; B,M

Fluorine anion + Ethanol, 2,2,2-trifluoro- = (Fluorine anion • Ethanol, 2,2,2-trifluoro-)

By formula: F- + C2H3F3O = (F- • C2H3F3O)

Quantity Value Units Method Reference Comment
Δr164. ± 8.4kJ/molIMRELarson and McMahon, 1983gas phase; These relative affinities are ca. 10 kcal/mol weaker than threshold values (see Wenthold and Squires, 1995) for donors greater than ca. 27 kcal/mol in free energy. This discrepancy has not yet been resolved, though the stronger value appears preferable.; B,M
Quantity Value Units Method Reference Comment
Δr112.J/mol*KN/ALarson and McMahon, 1983gas phase; switching reaction(F-)H2O, Entropy change calculated or estimated; Arshadi, Yamdagni, et al., 1970; M
Quantity Value Units Method Reference Comment
Δr130. ± 8.4kJ/molIMRELarson and McMahon, 1983gas phase; These relative affinities are ca. 10 kcal/mol weaker than threshold values (see Wenthold and Squires, 1995) for donors greater than ca. 27 kcal/mol in free energy. This discrepancy has not yet been resolved, though the stronger value appears preferable.; B,M

Fluorine anion + F3Sc = (Fluorine anion • F3Sc)

By formula: F- + F3Sc = (F- • F3Sc)

Quantity Value Units Method Reference Comment
Δr474. ± 15.kJ/molTDAsBoltalina, Borshchevskii, et al., 1992gas phase; Critical review; value altered from reference due to conversion from electron convention to ion convention; B
Δr470. ± 10.kJ/molTDEqNikitin, Igolkina, et al., 1986gas phase; Reanalyzed literature data, 4.3 kcal < AlF3; B
Δr487.4 ± 9.6kJ/molTDEqNikitin, Sidorov, et al., 1981gas phase; Fluoride Affinity: 4.1 kcal < AlF3; value altered from reference due to conversion from electron convention to ion convention; B
Δr495. ± 10.kJ/molTDEqSkokan, Nikitin, et al., 1981gas phase; Fluoride Affinity: 2.5 kcal < AlF3.; value altered from reference due to conversion from electron convention to ion convention; B
Δr469.kJ/molMSPyatenko, Gusarov, et al., 1981gas phase; Knudsen cell; M

(Fluorine anion • Water) + Water = (Fluorine anion • 2Water)

By formula: (F- • H2O) + H2O = (F- • 2H2O)

Bond type: Hydrogen bond (negative ion to hydride)

Quantity Value Units Method Reference Comment
Δr80.3 ± 2.1kJ/molTDAsHiraoka, Mizuse, et al., 1988gas phase; Stated electron affinity is the Vertical Detachment Energy; B,M
Δr69.5 ± 4.2kJ/molTDAsPayzant, Yamdagni, et al., 1971gas phase; B
Δr69.5 ± 4.2kJ/molTDAsArshadi, Yamdagni, et al., 1970gas phase; B,M
Quantity Value Units Method Reference Comment
Δr92.9J/mol*KPHPMSHiraoka, Mizuse, et al., 1988gas phase; M
Δr78.2J/mol*KHPMSArshadi, Yamdagni, et al., 1970gas phase; M
Quantity Value Units Method Reference Comment
Δr52.3 ± 6.7kJ/molTDAsHiraoka, Mizuse, et al., 1988gas phase; Stated electron affinity is the Vertical Detachment Energy; B
Δr46.0 ± 5.9kJ/molTDAsPayzant, Yamdagni, et al., 1971gas phase; B
Δr46.02kJ/molTDAsArshadi, Yamdagni, et al., 1970gas phase; B

Fluorine anion + C4H10BF = (Fluorine anion • C4H10BF)

By formula: F- + C4H10BF = (F- • C4H10BF)

Quantity Value Units Method Reference Comment
Δr267.8kJ/molIMRBMurphy and Beauchamp, 1977, 2gas phase; Fluoride Affinity: iPr3B > Et2BF > Et3B; B
Δr243. ± 21.kJ/molIMRELarson and McMahon, 1985gas phase; These relative affinities are ca. 10 kcal/mol weaker than threshold values (see Wenthold and Squires, 1995) for donors greater than ca. 27 kcal/mol in free energy. This discrepancy has not yet been resolved, though the stronger value appears preferable.; B,M
Quantity Value Units Method Reference Comment
Δr215. ± 21.kJ/molIMRELarson and McMahon, 1985gas phase; These relative affinities are ca. 10 kcal/mol weaker than threshold values (see Wenthold and Squires, 1995) for donors greater than ca. 27 kcal/mol in free energy. This discrepancy has not yet been resolved, though the stronger value appears preferable.; B

Fluorine anion + Carbon dioxide = (Fluorine anion • Carbon dioxide)

By formula: F- + CO2 = (F- • CO2)

Quantity Value Units Method Reference Comment
Δr134.2kJ/molN/AArnold, Bradforth, et al., 1995gas phase; B
Δr135. ± 8.4kJ/molTDAsHiraoka, Mizuse, et al., 1987gas phase; B,M
Δr133. ± 8.4kJ/molIMRELarson and McMahon, 1985gas phase; B,M
Δr138. ± 13.kJ/molIMREMcMahon and Northcott, 1978gas phase; B
Quantity Value Units Method Reference Comment
Δr112.J/mol*KPHPMSHiraoka, Mizuse, et al., 1987gas phase; M
Δr100.J/mol*KN/ALarson and McMahon, 1985gas phase; switching reaction,Thermochemical ladder(F-)H2O, Entropy change calculated or estimated; Arshadi, Yamdagni, et al., 1970; M
Quantity Value Units Method Reference Comment
Δr102. ± 8.4kJ/molTDAsHiraoka, Mizuse, et al., 1987gas phase; B
Δr103. ± 8.4kJ/molIMRELarson and McMahon, 1985gas phase; B,M
Δr48.5kJ/molFASpears and Ferguson, 1973gas phase; DG>; M

Fluorine anion + Sulfur tetrafluoride oxide = (Fluorine anion • Sulfur tetrafluoride oxide)

By formula: F- + F4OS = (F- • F4OS)

Quantity Value Units Method Reference Comment
Δr243. ± 13.kJ/molIMRELarson and McMahon, 1987gas phase; These relative affinities are ca. 10 kcal/mol weaker than threshold values (see Wenthold and Squires, 1995) for donors greater than ca. 27 kcal/mol in free energy. This discrepancy has not yet been resolved, though the stronger value appears preferable.; B,M
Δr280. ± 42.kJ/molIMRBArnold, Miller, et al., 2002gas phase; B
Quantity Value Units Method Reference Comment
Δr220. ± 8.4kJ/molIMRELarson and McMahon, 1987gas phase; These relative affinities are ca. 10 kcal/mol weaker than threshold values (see Wenthold and Squires, 1995) for donors greater than ca. 27 kcal/mol in free energy. This discrepancy has not yet been resolved, though the stronger value appears preferable.; B

(Fluorine anion • 2Water) + Water = (Fluorine anion • 3Water)

By formula: (F- • 2H2O) + H2O = (F- • 3H2O)

Bond type: Hydrogen bond (negative ion to hydride)

Quantity Value Units Method Reference Comment
Δr64.0 ± 1.7kJ/molTDAsHiraoka, Mizuse, et al., 1988gas phase; B,M
Δr57.3 ± 4.2kJ/molTDAsPayzant, Yamdagni, et al., 1971gas phase; B
Δr57.3 ± 4.2kJ/molTDAsArshadi, Yamdagni, et al., 1970gas phase; B,M
Quantity Value Units Method Reference Comment
Δr95.8J/mol*KPHPMSHiraoka, Mizuse, et al., 1988gas phase; M
Δr85.4J/mol*KHPMSArshadi, Yamdagni, et al., 1970gas phase; M
Quantity Value Units Method Reference Comment
Δr35. ± 5.4kJ/molTDAsHiraoka, Mizuse, et al., 1988gas phase; B
Δr32. ± 5.9kJ/molTDAsPayzant, Yamdagni, et al., 1971gas phase; B
Δr31.8kJ/molTDAsArshadi, Yamdagni, et al., 1970gas phase; B

Fluorine anion + AsFS- = (Fluorine anion • AsFS-)

By formula: F- + AsFS- = (F- • AsFS-)

Quantity Value Units Method Reference Comment
Δr234. ± 25.kJ/molIMRBLarson and McMahon, 1987gas phase; These relative affinities are ca. 10 kcal/mol weaker than threshold values (see Wenthold and Squires, 1995) for donors greater than ca. 27 kcal/mol in free energy. This discrepancy has not yet been resolved, though the stronger value appears preferable.; B,M
Quantity Value Units Method Reference Comment
Δr199. ± 25.kJ/molIMRBLarson and McMahon, 1987gas phase; These relative affinities are ca. 10 kcal/mol weaker than threshold values (see Wenthold and Squires, 1995) for donors greater than ca. 27 kcal/mol in free energy. This discrepancy has not yet been resolved, though the stronger value appears preferable.; B

Fluorine anion + AsFO = (Fluorine anion • AsFO)

By formula: F- + AsFO = (F- • AsFO)

Quantity Value Units Method Reference Comment
Δr226. ± 29.kJ/molIMRBLarson and McMahon, 1987gas phase; These relative affinities are ca. 10 kcal/mol weaker than threshold values (see Wenthold and Squires, 1995) for donors greater than ca. 27 kcal/mol in free energy. This discrepancy has not yet been resolved, though the stronger value appears preferable.; B,M
Quantity Value Units Method Reference Comment
Δr201. ± 29.kJ/molIMRBLarson and McMahon, 1987gas phase; These relative affinities are ca. 10 kcal/mol weaker than threshold values (see Wenthold and Squires, 1995) for donors greater than ca. 27 kcal/mol in free energy. This discrepancy has not yet been resolved, though the stronger value appears preferable.; B

Fluorine anion + Disulfur monoxide = (Fluorine anion • Disulfur monoxide)

By formula: F- + OS2 = (F- • OS2)

Quantity Value Units Method Reference Comment
Δr184. ± 13.kJ/molIMRBLarson and McMahon, 1987gas phase; These relative affinities are ca. 10 kcal/mol weaker than threshold values (see Wenthold and Squires, 1995) for donors greater than ca. 27 kcal/mol in free energy. This discrepancy has not yet been resolved, though the stronger value appears preferable.; B,M
Quantity Value Units Method Reference Comment
Δr155. ± 13.kJ/molIMRBLarson and McMahon, 1987gas phase; These relative affinities are ca. 10 kcal/mol weaker than threshold values (see Wenthold and Squires, 1995) for donors greater than ca. 27 kcal/mol in free energy. This discrepancy has not yet been resolved, though the stronger value appears preferable.; B

Fluorine anion + C4H4F6O = (Fluorine anion • C4H4F6O)

By formula: F- + C4H4F6O = (F- • C4H4F6O)

Quantity Value Units Method Reference Comment
Δr192. ± 8.4kJ/molIMRELarson and McMahon, 1983gas phase; These relative affinities are ca. 10 kcal/mol weaker than threshold values (see Wenthold and Squires, 1995) for donors greater than ca. 27 kcal/mol in free energy. This discrepancy has not yet been resolved, though the stronger value appears preferable.; B
Quantity Value Units Method Reference Comment
Δr159. ± 8.4kJ/molIMRELarson and McMahon, 1983gas phase; These relative affinities are ca. 10 kcal/mol weaker than threshold values (see Wenthold and Squires, 1995) for donors greater than ca. 27 kcal/mol in free energy. This discrepancy has not yet been resolved, though the stronger value appears preferable.; B

Fluorine anion + 1,1,1,3,3,3-Hexafluoro-2-(trifluoromethyl)-2-propanol = (Fluorine anion • 1,1,1,3,3,3-Hexafluoro-2-(trifluoromethyl)-2-propanol)

By formula: F- + C4HF9O = (F- • C4HF9O)

Quantity Value Units Method Reference Comment
Δr236. ± 8.4kJ/molIMRELarson and McMahon, 1983gas phase; These relative affinities are ca. 10 kcal/mol weaker than threshold values (see Wenthold and Squires, 1995) for donors greater than ca. 27 kcal/mol in free energy. This discrepancy has not yet been resolved, though the stronger value appears preferable.; B
Quantity Value Units Method Reference Comment
Δr200. ± 8.4kJ/molIMRELarson and McMahon, 1983gas phase; These relative affinities are ca. 10 kcal/mol weaker than threshold values (see Wenthold and Squires, 1995) for donors greater than ca. 27 kcal/mol in free energy. This discrepancy has not yet been resolved, though the stronger value appears preferable.; B

Fluorine anion + Boric acid, trimethyl ester = (Fluorine anion • Boric acid, trimethyl ester)

By formula: F- + C3H9BO3 = (F- • C3H9BO3)

Quantity Value Units Method Reference Comment
Δr176. ± 17.kJ/molIMRBLarson and McMahon, 1985gas phase; These relative affinities are ca. 10 kcal/mol weaker than threshold values (see Wenthold and Squires, 1995) for donors greater than ca. 27 kcal/mol in free energy. This discrepancy has not yet been resolved, though the stronger value appears preferable.; B,M
Quantity Value Units Method Reference Comment
Δr142. ± 13.kJ/molIMRBLarson and McMahon, 1985gas phase; These relative affinities are ca. 10 kcal/mol weaker than threshold values (see Wenthold and Squires, 1995) for donors greater than ca. 27 kcal/mol in free energy. This discrepancy has not yet been resolved, though the stronger value appears preferable.; B

Fluorine anion + Triethyl borate = (Fluorine anion • Triethyl borate)

By formula: F- + C6H15BO3 = (F- • C6H15BO3)

Quantity Value Units Method Reference Comment
Δr184. ± 13.kJ/molIMRBLarson and McMahon, 1985gas phase; These relative affinities are ca. 10 kcal/mol weaker than threshold values (see Wenthold and Squires, 1995) for donors greater than ca. 27 kcal/mol in free energy. This discrepancy has not yet been resolved, though the stronger value appears preferable.; B,M
Quantity Value Units Method Reference Comment
Δr153. ± 8.4kJ/molIMRBLarson and McMahon, 1985gas phase; These relative affinities are ca. 10 kcal/mol weaker than threshold values (see Wenthold and Squires, 1995) for donors greater than ca. 27 kcal/mol in free energy. This discrepancy has not yet been resolved, though the stronger value appears preferable.; B

Fluorine anion + fluorodimethoxyborane = (Fluorine anion • fluorodimethoxyborane)

By formula: F- + C2H6BFO2 = (F- • C2H6BFO2)

Quantity Value Units Method Reference Comment
Δr218. ± 21.kJ/molIMRELarson and McMahon, 1985gas phase; These relative affinities are ca. 10 kcal/mol weaker than threshold values (see Wenthold and Squires, 1995) for donors greater than ca. 27 kcal/mol in free energy. This discrepancy has not yet been resolved, though the stronger value appears preferable.; B,M
Quantity Value Units Method Reference Comment
Δr190. ± 21.kJ/molIMRELarson and McMahon, 1985gas phase; These relative affinities are ca. 10 kcal/mol weaker than threshold values (see Wenthold and Squires, 1995) for donors greater than ca. 27 kcal/mol in free energy. This discrepancy has not yet been resolved, though the stronger value appears preferable.; B

Fluorine anion + 2-Propanol, 1,1,1,3,3,3-hexafluoro- = (Fluorine anion • 2-Propanol, 1,1,1,3,3,3-hexafluoro-)

By formula: F- + C3H2F6O = (F- • C3H2F6O)

Quantity Value Units Method Reference Comment
Δr197. ± 8.4kJ/molIMRELarson and McMahon, 1983gas phase; These relative affinities are ca. 10 kcal/mol weaker than threshold values (see Wenthold and Squires, 1995) for donors greater than ca. 27 kcal/mol in free energy. This discrepancy has not yet been resolved, though the stronger value appears preferable.; B
Quantity Value Units Method Reference Comment
Δr163. ± 8.4kJ/molIMRELarson and McMahon, 1983gas phase; These relative affinities are ca. 10 kcal/mol weaker than threshold values (see Wenthold and Squires, 1995) for donors greater than ca. 27 kcal/mol in free energy. This discrepancy has not yet been resolved, though the stronger value appears preferable.; B

Fluorine anion + FPS = F2PS-

By formula: F- + FPS = F2PS-

Quantity Value Units Method Reference Comment
Δr259. ± 21.kJ/molIMRBLarson and McMahon, 1987gas phase; These relative affinities are ca. 10 kcal/mol weaker than threshold values (see Wenthold and Squires, 1995) for donors greater than ca. 27 kcal/mol in free energy. This discrepancy has not yet been resolved, though the stronger value appears preferable.; B
Quantity Value Units Method Reference Comment
Δr234. ± 17.kJ/molIMRBLarson and McMahon, 1987gas phase; These relative affinities are ca. 10 kcal/mol weaker than threshold values (see Wenthold and Squires, 1995) for donors greater than ca. 27 kcal/mol in free energy. This discrepancy has not yet been resolved, though the stronger value appears preferable.; B

References

Larson and McMahon, 1985
Larson, J.W.; McMahon, T.B., Fluoride and chloride affinities of the main group oxides, fluorides, oxofluorides, and alkyls. Quantitative scales of lewis acidities from ICR halide exchange equilibria, J. Am. Chem. Soc., 1985, 107, 766. [all data]

Wenthold and Squires, 1995
Wenthold, P.G.; Squires, R.R., Bond dissociation energies of F2(-) and HF2(-). A gas-phase experimental and G2 theoretical study, J. Phys. Chem., 1995, 99, 7, 2002, https://doi.org/10.1021/j100007a034 . [all data]

Blondel, Delsart, et al., 2001
Blondel, C.; Delsart, C.; Goldfarb, F., Electron spectrometry at the mu eV level and the electron affinities of Si and F, J. Phys. B: Atom. Mol. Opt. Phys., 2001, 34, 9, L281-L288, https://doi.org/10.1088/0953-4075/34/9/101 . [all data]

Martin and Hepburn, 2000
Martin, J.D.D.; Hepburn, J.W., Faraday Disc. Chem. Soc., 2000, 115, 416. [all data]

Wagman, Evans, et al., 1982
Wagman, D.D.; Evans, W.H.; Parker, V.B.; Schumm, R.H.; Halow, I.; Bailey, S.M.; Churney, K.L.; Nuttall, R.L., The NBS Tables of Chemical Thermodynamic Properties (NBS Tech Note 270), J. Phys. Chem. Ref. Data, Supl. 1, 1982, 11. [all data]

Blondel, Cacciani, et al., 1989
Blondel, C.; Cacciani, P.; Delsart, C.; Trainham, R., High Resolution Determination of the Electron Affinity of Fluorine and Bromine using Crossed Ion and Laser Beams, Phys. Rev. A, 1989, 40, 7, 3698, https://doi.org/10.1103/PhysRevA.40.3698 . [all data]

Bierbaum, Schmidt, et al., 1981
Bierbaum, V.M.; Schmidt, R.J.; DePuy, C.H.; Mead, R.H.; Schulz, P.A.; Lineberger, W.C., Reactions of carbanions with triplet and singlet molecular oxygen, J. Am. Chem. Soc., 1981, 103, 6262. [all data]

Check, Faust, et al., 2001
Check, C.E.; Faust, T.O.; Bailey, J.M.; Wright, B.J.; Gilbert, T.M.; Sunderlin, L.S., Addition of Polarization and Diffuse Functions to the LANL2DZ Basis Set for P-Block Elements, J. Phys. Chem. A,, 2001, 105, 34, 8111, https://doi.org/10.1021/jp011945l . [all data]

Lobring, Check, et al., 2003
Lobring, K.C.; Check, C.E.; Sunderlin, L.S., The fluoride affinity of SO2, Int. J. Mass Spectrom., 2003, 222, 1-3, 221-227, https://doi.org/10.1016/S1387-3806(02)00950-8 . [all data]

Squires, 1992
Squires, R.R., Gas Phase Thermochemical Properties of the Bicarbonate and Bisulfate Ions, Int. J. Mass Spectrom. Ion Proc., 1992, 117, 565, https://doi.org/10.1016/0168-1176(92)80114-G . [all data]

Arshadi, Yamdagni, et al., 1970
Arshadi, M.; Yamdagni, R.; Kebarle, P., Hydration of Halide Negative Ions in the Gas Phase. II. Comparison of Hydration Energies for the Alkali Positive and Halide Negative Ions, J. Phys. Chem., 1970, 74, 7, 1475, https://doi.org/10.1021/j100702a014 . [all data]

Larson and McMahon, 1983
Larson, J.W.; McMahon, T.B., Strong hydrogen bonding in gas-phase anions. An ion cyclotron resonance determination of fluoride binding energetics to bronsted acids from gas-phase fluoride exchange equilibria measurements, J. Am. Chem. Soc., 1983, 105, 2944. [all data]

Robbiani and Franklin, 1979
Robbiani, R.; Franklin, J.L., Negative ion-molecule reaction in sulfuryl halides, J. Am. Chem. Soc., 1979, 101, 3709. [all data]

Sullivan and Beauchamp, 1978
Sullivan, S.A.; Beauchamp, J.L., Nucleophilic Reactions of Anions with PF3 and OPF3 in the Gas Phase by ICR Spectroscopy, Inorg. Chem., 1978, 17, 6, 1589, https://doi.org/10.1021/ic50184a039 . [all data]

Heni and Illenberger, 1985
Heni, M.; Illenberger, E., The stability of the bifluoride ion (HF2-) in the gas phase, J. Chem. Phys., 1985, 83, 6056. [all data]

Berkowitz, Ellison, et al., 1994
Berkowitz, J.; Ellison, G.B.; Gutman, D., Three methods to measure RH bond energies, J. Phys. Chem., 1994, 98, 2744. [all data]

Aleshina, Borshchevskii, et al., 1996
Aleshina, V.E.; Borshchevskii, Ya.; Korobov, V.M.; Sidorov, L.N., The Enthalpy of Addition of the Fluorine Anion to the BF3 and PF5 Molecules, Russ. J. Phys. Chem., 1996, 70, 1085. [all data]

Mallouk, Rosenthal, et al., 1984
Mallouk, T.E.; Rosenthal, G.L.; Muller, G.; Brusasco, R.; Bartlett, N., Fluoride ion affinities of GeF4 and BF4 from thermodynamic and structural data for (SF2)2GeF6, ClO2GeF5, and ClO2BF4, Inorg. Chem., 1984, 23, 3167. [all data]

Larson and McMahon, 1984
Larson, J.W.; McMahon, T.B., Fluoride and chloride affinities of main group oxides, fluorides, oxofluorides, and alkyls. Quantitative scales of lewis acidities from ion cyclotron resonance halide-exchange equilibria, J. Phys. Chem., 1984, 88, 1083. [all data]

Rhyne and Dillard, 1971
Rhyne, T.C.; Dillard, J.G., Reactions of gaseous inorganic negative ions: III. SF6- with POF3 and PSF3, Int. J. Mass Spectrom. Ion Phys., 1971, 7, 371. [all data]

Kawamata, Neigishi, et al., 1996
Kawamata, H.; Neigishi, Y.; Kishi, R.; Iwata, S.; Nakajima, A.; Kaya, K., Photoelectron Spectroscopy of Silicon-Fluorine Binary Cluster Anions (SinFm-), J. Chem. Phys., 1996, 105, 13, 5369, https://doi.org/10.1063/1.472377 . [all data]

Murphy and Beauchamp, 1977
Murphy, M.K.; Beauchamp, J.L., Methyl and Fluorine Substituent Effects on the Gas Phase Lewis Acidities of Silanes by ICR Spectroscopy, J. Am. Chem. Soc., 1977, 99, 15, 4992, https://doi.org/10.1021/ja00457a017 . [all data]

Lobring, Check, et al., 2003, 2
Lobring, K.C.; Check, C.E.; Gilbert, T.M.; Sunderlin, L.S., New measurements of the thermochemistry of SF5- and SF6-, Int. J. Mass Spectrom., 2003, 227, 3, 361-372, https://doi.org/10.1016/S1387-3806(03)00105-2 . [all data]

Leffert, Tang, et al., 1974
Leffert, C.B.; Tang, S.Y.; Rothe, E.W.; Cheng, T.C., Collisional ionization of Cs with SF6, J. Chem. Phys., 1974, 61, 4929. [all data]

Babcock and Streit, 1981
Babcock, L.M.; Streit, G.E., Negative ion-molecule reactions of SF4, J. Chem. Phys., 1981, 75, 3864. [all data]

Murphy and Beauchamp, 1977, 2
Murphy, M.K.; Beauchamp, J.L., Fluorine and Alkyl Substituent Effects on Gas-Phase Lewis Acidities of Boranes by ICR Spectroscopy, Inorg. Chem., 1977, 16, 2437. [all data]

Galembeck, Faigle, et al., 1978
Galembeck, S.E.; Faigle, J.F.G.; Riveros, J.M., An. Acad. Brasil Cienc., 1978, 50, 1. [all data]

Boltalina, Borshchevskii, et al., 1992
Boltalina, O.V.; Borshchevskii, A.Y.; Sidorov, L.N., Thermochemistry of 3d Elements Fluorides and Their Negative Ions in Gas Phase, Russ. J. Phys. Chem., 1992, 66, 1223. [all data]

Nikitin, Igolkina, et al., 1986
Nikitin, M.I.; Igolkina, N.A.; Skokan, E.V.; Sorokin, I.D.; Sidirov, L.N., Enthalpies of formation of the AlF4- ion, J. Phys. Chem., 1986, 60, 22. [all data]

Nikitin, Sidorov, et al., 1981
Nikitin, M.I.; Sidorov, L.N.; Skokan, E.V.; Sorokin, I.D., Mass spectrometric determination of the heats of formation of ScF4- and KF2-, Russ. J. Phys. Chem., 1981, 55, 1107. [all data]

Skokan, Nikitin, et al., 1981
Skokan, E.V.; Nikitin, M.I.; Sorokin, I.D.; Gusarov, A.V.; Sidirov, L.N., Determination of the heat of formation of the tetrafluoroscandate and pentfluorozirconate ions by the effusion nethod, Russ. J. Phys. Chem., 1981, 55, 1062. [all data]

Pyatenko, Gusarov, et al., 1981
Pyatenko, A.T.; Gusarov, A.V.; Gorokhov, L.N., Negative Ions in the Vapor Over Lanthanum Trifluoride, High Temp., 1981, 19, 241. [all data]

Hiraoka, Mizuse, et al., 1988
Hiraoka, K.; Mizuse, S.; Yamabe, S., Solvation of Halide Ions with H2O and CH3CN in the Gas Phase, J. Phys. Chem., 1988, 92, 13, 3943, https://doi.org/10.1021/j100324a051 . [all data]

Payzant, Yamdagni, et al., 1971
Payzant, J.D.; Yamdagni, R.; Kebarle, P., Hydration of CN-, NO2-, NO3-, and HO- in the gas phase, Can. J. Chem., 1971, 49, 3308. [all data]

Arnold, Bradforth, et al., 1995
Arnold, D.W.; Bradforth, S.E.; Kim, E.H.; Neumark, D.M., Study of halogen carbon dioxide clusters and the fluoroformyloxyl radical by photodetachment of X(-)(CO2) (X=I,Cl,Br) and FCO2-, J. Chem. Phys., 1995, 102, 9, 3493, https://doi.org/10.1063/1.468575 . [all data]

Hiraoka, Mizuse, et al., 1987
Hiraoka, K.; Mizuse, S.; Yamabe, S., Stability and Structure of Cluster Ions: Halide Ions with CO2, J. Chem. Phys., 1987, 87, 6, 3647, https://doi.org/10.1063/1.452962 . [all data]

McMahon and Northcott, 1978
McMahon, T.B.; Northcott, C.J., The Fluoroformate Ion FCO2-: An ICR study of the gas phase lewis acidity of carbon dioxide and related isoelectronic species, Can. J. Chem., 1978, 56, 1068. [all data]

Spears and Ferguson, 1973
Spears, K.G.; Ferguson, E.E., Termolecular and Saturated Termolecular Kinetics for Li+ and F-, J. Chem. Phys., 1973, 59, 8, 4174, https://doi.org/10.1063/1.1680610 . [all data]

Larson and McMahon, 1987
Larson, J.W.; McMahon, T.B., Trends in Gas Phase Fluoride Ion Affinities of the Main Group Oxyfluorides and Fluoride Sulfides. Fluoride Adducts of FAsO, FPO, FPO2, F2SiO, F4SO, FBO, F2SiS, FPS, FAsS, F2S2, and S2O., Inorg. Chem., 1987, 26, 24, 4018, https://doi.org/10.1021/ic00271a011 . [all data]

Arnold, Miller, et al., 2002
Arnold, S.T.; Miller, T.M.; Viggiano, A.A., A combined experimental and theoretical study of sulfur oxyfluoride anion and neutral thermochemistry and reactivity, J. Phys. Chem. A, 2002, 106, 42, 9900-9909, https://doi.org/10.1021/jp020557w . [all data]