2-[(1,1-dimethylethyl)dioxy]ethanol

Phase change data

Data compiled by: Hussein Y. Afeefy, Joel F. Liebman, and Stephen E. Stein

Enthalpy of vaporization

ΔvapH (kJ/mol) Temperature (K) Method Reference Comment
66.4 ± 1.9290.VVan Chin Syan, Kachurina, et al., 1983Undetermined error

References

Van Chin Syan, Kachurina, et al., 1983
Van Chin Syan, Yu.Ya.; Kachurina, N.S.; Petrovskaya, G.A.; Chuchmarev, S.K., Thermodynamic properties of certain hydroxyperoxides, Russ. J. Phys. Chem. (Engl. Transl.), 1983, 57, 1751-1752, In original 1145. [all data]