beryllium orthosilicate

Condensed phase thermochemistry data

Quantity Value Units Method Reference Comment
Δfsolid-2117.23kJ/molReviewChase, 1998Data last reviewed in June, 1965
Quantity Value Units Method Reference Comment
solid64.08J/mol*KReviewChase, 1998Data last reviewed in June, 1965

Solid Phase Heat Capacity (Shomate Equation)

Cp° = A + B*t + C*t2 + D*t3 + E/t2
H° − H°298.15= A*t + B*t2/2 + C*t3/3 + D*t4/4 − E/t + F − H
S° = A*ln(t) + B*t + C*t2/2 + D*t3/3 − E/(2*t2) + G
    Cp = heat capacity (J/mol*K)
    H° = standard enthalpy (kJ/mol)
    S° = standard entropy (J/mol*K)
    t = temperature (K) / 1000.

View plot Requires a JavaScript / HTML 5 canvas capable browser.

View table.

Temperature (K) 298. - 900.900. - 3000.
A 107.0811206.0448
B 62.44160-25.85570
C 83.9025912.01118
D -77.62952-1.455296
E -3.162059-16.73650
F -2163.161-2226.603
G 154.2218246.2895
H -2117.230-2117.230
ReferenceChase, 1998Chase, 1998
Comment Data last reviewed in June, 1965 Data last reviewed in June, 1965

References

Chase, 1998
Chase, M.W., Jr., NIST-JANAF Themochemical Tables, Fourth Edition, J. Phys. Chem. Ref. Data, Monograph 9, 1998, 1-1951. [all data]