Lead ion (1+)

Ion clustering data

Data compiled by: Michael M. Meot-Ner (Mautner) and Sharon G. Lias

Clustering reactions

Lead ion (1+) + Methyl Alcohol = (Lead ion (1+) • Methyl Alcohol)

By formula: Pb+ + CH4O = (Pb+ • CH4O)

Quantity Value Units Method Reference Comment
Δr97.5 ± 0.8kJ/molHPMSGuo and Castleman, 1990gas phase
Quantity Value Units Method Reference Comment
Δr97.5J/mol*KHPMSGuo and Castleman, 1990gas phase

(Lead ion (1+) • Methyl Alcohol) + Methyl Alcohol = (Lead ion (1+) • 2Methyl Alcohol)

By formula: (Pb+ • CH4O) + CH4O = (Pb+ • 2CH4O)

Quantity Value Units Method Reference Comment
Δr72. ± 1.kJ/molHPMSGuo and Castleman, 1990gas phase
Quantity Value Units Method Reference Comment
Δr111.J/mol*KHPMSGuo and Castleman, 1990gas phase

Lead ion (1+) + Methylamine = (Lead ion (1+) • Methylamine)

By formula: Pb+ + CH5N = (Pb+ • CH5N)

Quantity Value Units Method Reference Comment
Δr148. ± 1.kJ/molHPMSGuo and Castleman, 1990gas phase
Quantity Value Units Method Reference Comment
Δr126.J/mol*KHPMSGuo and Castleman, 1990gas phase

(Lead ion (1+) • Methylamine) + Methylamine = (Lead ion (1+) • 2Methylamine)

By formula: (Pb+ • CH5N) + CH5N = (Pb+ • 2CH5N)

Quantity Value Units Method Reference Comment
Δr79.9 ± 0.8kJ/molHPMSGuo and Castleman, 1990gas phase
Quantity Value Units Method Reference Comment
Δr81.6J/mol*KHPMSGuo and Castleman, 1990gas phase

Lead ion (1+) + Benzene = (Lead ion (1+) • Benzene)

By formula: Pb+ + C6H6 = (Pb+ • C6H6)

Quantity Value Units Method Reference Comment
Δr110.kJ/molPHPMSGuo, Purnell, et al., 1990gas phase
Quantity Value Units Method Reference Comment
Δr90.4J/mol*KPHPMSGuo, Purnell, et al., 1990gas phase

Lead ion (1+) + Water = (Lead ion (1+) • Water)

By formula: Pb+ + H2O = (Pb+ • H2O)

Quantity Value Units Method Reference Comment
Δr93.7kJ/molHPMSTang and Castleman, 1972gas phase
Quantity Value Units Method Reference Comment
Δr149.J/mol*KHPMSTang and Castleman, 1972gas phase

(Lead ion (1+) • Water) + Water = (Lead ion (1+) • 2Water)

By formula: (Pb+ • H2O) + H2O = (Pb+ • 2H2O)

Quantity Value Units Method Reference Comment
Δr70.7kJ/molHPMSTang and Castleman, 1972gas phase
Quantity Value Units Method Reference Comment
Δr106.J/mol*KHPMSTang and Castleman, 1972gas phase

(Lead ion (1+) • 2Water) + Water = (Lead ion (1+) • 3Water)

By formula: (Pb+ • 2H2O) + H2O = (Pb+ • 3H2O)

Quantity Value Units Method Reference Comment
Δr51.0kJ/molHPMSTang and Castleman, 1972gas phase
Quantity Value Units Method Reference Comment
Δr84.5J/mol*KHPMSTang and Castleman, 1972gas phase

(Lead ion (1+) • 4Water) + Water = (Lead ion (1+) • 5Water)

By formula: (Pb+ • 4H2O) + H2O = (Pb+ • 5H2O)

Quantity Value Units Method Reference Comment
Δr41.8kJ/molHPMSTang and Castleman, 1972gas phase
Quantity Value Units Method Reference Comment
Δr93.3J/mol*KHPMSTang and Castleman, 1972gas phase

(Lead ion (1+) • 5Water) + Water = (Lead ion (1+) • 6Water)

By formula: (Pb+ • 5H2O) + H2O = (Pb+ • 6H2O)

Quantity Value Units Method Reference Comment
Δr40.kJ/molHPMSTang and Castleman, 1972gas phase
Quantity Value Units Method Reference Comment
Δr98.7J/mol*KHPMSTang and Castleman, 1972gas phase

Lead ion (1+) + Ammonia = (Lead ion (1+) • Ammonia)

By formula: Pb+ + H3N = (Pb+ • H3N)

Quantity Value Units Method Reference Comment
Δr118.kJ/molHPMSGuo and Castleman, 1991gas phase; ΔrS from graph
Quantity Value Units Method Reference Comment
Δr98.7J/mol*KHPMSGuo and Castleman, 1991gas phase; ΔrS from graph

(Lead ion (1+) • Ammonia) + Ammonia = (Lead ion (1+) • 2Ammonia)

By formula: (Pb+ • H3N) + H3N = (Pb+ • 2H3N)

Quantity Value Units Method Reference Comment
Δr80.3kJ/molHPMSGuo and Castleman, 1991gas phase; ΔrS from graph
Quantity Value Units Method Reference Comment
Δr113.J/mol*KHPMSGuo and Castleman, 1991gas phase; ΔrS from graph

(Lead ion (1+) • 2Ammonia) + Ammonia = (Lead ion (1+) • 3Ammonia)

By formula: (Pb+ • 2H3N) + H3N = (Pb+ • 3H3N)

Quantity Value Units Method Reference Comment
Δr54.4kJ/molHPMSGuo and Castleman, 1991gas phase; ΔrS from graph
Quantity Value Units Method Reference Comment
Δr89.5J/mol*KHPMSGuo and Castleman, 1991gas phase; ΔrS from graph

(Lead ion (1+) • 3Ammonia) + Ammonia = (Lead ion (1+) • 4Ammonia)

By formula: (Pb+ • 3H3N) + H3N = (Pb+ • 4H3N)

Quantity Value Units Method Reference Comment
Δr44.8kJ/molHPMSGuo and Castleman, 1991gas phase; ΔrS from graph
Quantity Value Units Method Reference Comment
Δr102.J/mol*KHPMSGuo and Castleman, 1991gas phase; ΔrS from graph

Gas phase thermochemistry data

Quantity Value Units Method Reference Comment
gas,1 bar181.14J/mol*KReviewChase, 1998Data last reviewed in March, 1983

Reaction thermochemistry data

Data compiled by: Michael M. Meot-Ner (Mautner) and Sharon G. Lias

Individual Reactions

(Lead ion (1+) • 2Ammonia) + Ammonia = (Lead ion (1+) • 3Ammonia)

By formula: (Pb+ • 2H3N) + H3N = (Pb+ • 3H3N)

Quantity Value Units Method Reference Comment
Δr13.0kcal/molHPMSGuo and Castleman, 1991gas phase; ΔrS from graph
Quantity Value Units Method Reference Comment
Δr21.4cal/mol*KHPMSGuo and Castleman, 1991gas phase; ΔrS from graph

(Lead ion (1+) • 3Ammonia) + Ammonia = (Lead ion (1+) • 4Ammonia)

By formula: (Pb+ • 3H3N) + H3N = (Pb+ • 4H3N)

Quantity Value Units Method Reference Comment
Δr10.7kcal/molHPMSGuo and Castleman, 1991gas phase; ΔrS from graph
Quantity Value Units Method Reference Comment
Δr24.3cal/mol*KHPMSGuo and Castleman, 1991gas phase; ΔrS from graph

(Lead ion (1+) • Ammonia) + Ammonia = (Lead ion (1+) • 2Ammonia)

By formula: (Pb+ • H3N) + H3N = (Pb+ • 2H3N)

Quantity Value Units Method Reference Comment
Δr19.2kcal/molHPMSGuo and Castleman, 1991gas phase; ΔrS from graph
Quantity Value Units Method Reference Comment
Δr27.0cal/mol*KHPMSGuo and Castleman, 1991gas phase; ΔrS from graph

Lead ion (1+) + Ammonia = (Lead ion (1+) • Ammonia)

By formula: Pb+ + H3N = (Pb+ • H3N)

Quantity Value Units Method Reference Comment
Δr28.3kcal/molHPMSGuo and Castleman, 1991gas phase; ΔrS from graph
Quantity Value Units Method Reference Comment
Δr23.6cal/mol*KHPMSGuo and Castleman, 1991gas phase; ΔrS from graph

(Lead ion (1+) • 2Water) + Water = (Lead ion (1+) • 3Water)

By formula: (Pb+ • 2H2O) + H2O = (Pb+ • 3H2O)

Quantity Value Units Method Reference Comment
Δr12.2kcal/molHPMSTang and Castleman, 1972gas phase
Quantity Value Units Method Reference Comment
Δr20.2cal/mol*KHPMSTang and Castleman, 1972gas phase

(Lead ion (1+) • 4Water) + Water = (Lead ion (1+) • 5Water)

By formula: (Pb+ • 4H2O) + H2O = (Pb+ • 5H2O)

Quantity Value Units Method Reference Comment
Δr10.0kcal/molHPMSTang and Castleman, 1972gas phase
Quantity Value Units Method Reference Comment
Δr22.3cal/mol*KHPMSTang and Castleman, 1972gas phase

(Lead ion (1+) • 5Water) + Water = (Lead ion (1+) • 6Water)

By formula: (Pb+ • 5H2O) + H2O = (Pb+ • 6H2O)

Quantity Value Units Method Reference Comment
Δr9.6kcal/molHPMSTang and Castleman, 1972gas phase
Quantity Value Units Method Reference Comment
Δr23.6cal/mol*KHPMSTang and Castleman, 1972gas phase

(Lead ion (1+) • Water) + Water = (Lead ion (1+) • 2Water)

By formula: (Pb+ • H2O) + H2O = (Pb+ • 2H2O)

Quantity Value Units Method Reference Comment
Δr16.9kcal/molHPMSTang and Castleman, 1972gas phase
Quantity Value Units Method Reference Comment
Δr25.3cal/mol*KHPMSTang and Castleman, 1972gas phase

(Lead ion (1+) • Methyl Alcohol) + Methyl Alcohol = (Lead ion (1+) • 2Methyl Alcohol)

By formula: (Pb+ • CH4O) + CH4O = (Pb+ • 2CH4O)

Quantity Value Units Method Reference Comment
Δr17.2 ± 0.3kcal/molHPMSGuo and Castleman, 1990gas phase
Quantity Value Units Method Reference Comment
Δr26.6cal/mol*KHPMSGuo and Castleman, 1990gas phase

(Lead ion (1+) • Methylamine) + Methylamine = (Lead ion (1+) • 2Methylamine)

By formula: (Pb+ • CH5N) + CH5N = (Pb+ • 2CH5N)

Quantity Value Units Method Reference Comment
Δr19.1 ± 0.2kcal/molHPMSGuo and Castleman, 1990gas phase
Quantity Value Units Method Reference Comment
Δr19.5cal/mol*KHPMSGuo and Castleman, 1990gas phase

Lead ion (1+) + Methyl Alcohol = (Lead ion (1+) • Methyl Alcohol)

By formula: Pb+ + CH4O = (Pb+ • CH4O)

Quantity Value Units Method Reference Comment
Δr23.3 ± 0.2kcal/molHPMSGuo and Castleman, 1990gas phase
Quantity Value Units Method Reference Comment
Δr23.3cal/mol*KHPMSGuo and Castleman, 1990gas phase

Lead ion (1+) + Methylamine = (Lead ion (1+) • Methylamine)

By formula: Pb+ + CH5N = (Pb+ • CH5N)

Quantity Value Units Method Reference Comment
Δr35.4 ± 0.3kcal/molHPMSGuo and Castleman, 1990gas phase
Quantity Value Units Method Reference Comment
Δr30.0cal/mol*KHPMSGuo and Castleman, 1990gas phase

Lead ion (1+) + Water = (Lead ion (1+) • Water)

By formula: Pb+ + H2O = (Pb+ • H2O)

Quantity Value Units Method Reference Comment
Δr22.4kcal/molHPMSTang and Castleman, 1972gas phase
Quantity Value Units Method Reference Comment
Δr35.5cal/mol*KHPMSTang and Castleman, 1972gas phase

Lead ion (1+) + Benzene = (Lead ion (1+) • Benzene)

By formula: Pb+ + C6H6 = (Pb+ • C6H6)

Quantity Value Units Method Reference Comment
Δr26.2kcal/molPHPMSGuo, Purnell, et al., 1990gas phase
Quantity Value Units Method Reference Comment
Δr21.6cal/mol*KPHPMSGuo, Purnell, et al., 1990gas phase

References

Guo and Castleman, 1990
Guo, B.C.; Castleman, A.W., The Association Reactions of Pb+ Ion with CH3OH and CH3NH2 in the Gas Phase, Int. J. Mass Spectrom. Ion Proc., 1990, 100, 665, https://doi.org/10.1016/0168-1176(90)85101-7 . [all data]

Guo, Purnell, et al., 1990
Guo, B.C.; Purnell, J.W.; Castleman, A.W., The Clustering Reactions of Benzene with Sodium and Lead Ions, Chem. Phys. Lett., 1990, 168, 2, 155, https://doi.org/10.1016/0009-2614(90)85122-S . [all data]

Tang and Castleman, 1972
Tang, I.N.; Castleman, A.W., Mass Spectrometric Study of the Gas - Phase Hydration of the Monovalent Lead Ion, J. Chem. Phys., 1972, 57, 9, 3638, https://doi.org/10.1063/1.1678820 . [all data]

Guo and Castleman, 1991
Guo, B.C.; Castleman, A.W., The Clustering Reactions of Na+ and Pb+ with Several Important Ligands, Zeit. Phys. D., 1991, 19, 1-4, 397, https://doi.org/10.1007/BF01448337 . [all data]