disodium disilicate

Condensed phase thermochemistry data

Quantity Value Units Method Reference Comment
Δfliquid-2438.48kJ/molReviewChase, 1998Data last reviewed in September, 1967
Quantity Value Units Method Reference Comment
liquid,1 bar188.84J/mol*KReviewChase, 1998Data last reviewed in September, 1967
Quantity Value Units Method Reference Comment
Δfsolid-2470.07kJ/molReviewChase, 1998Data last reviewed in September, 1967
Quantity Value Units Method Reference Comment
solid164.09J/mol*KReviewChase, 1998Data last reviewed in September, 1967

Liquid Phase Heat Capacity (Shomate Equation)

Cp° = A + B*t + C*t2 + D*t3 + E/t2
H° − H°298.15= A*t + B*t2/2 + C*t3/3 + D*t4/4 − E/t + F − H
S° = A*ln(t) + B*t + C*t2/2 + D*t3/3 − E/(2*t2) + G
    Cp = heat capacity (J/mol*K)
    H° = standard enthalpy (kJ/mol)
    S° = standard entropy (J/mol*K)
    t = temperature (K) / 1000.

View plot Requires a JavaScript / HTML 5 canvas capable browser.

View table.

Temperature (K) 1147. - 2500.
A 261.2070
B -0.000054
C 0.000023
D -0.000004
E -0.000011
F -2537.700
G 451.8110
H -2438.480
ReferenceChase, 1998
Comment Data last reviewed in September, 1967

Solid Phase Heat Capacity (Shomate Equation)

Cp° = A + B*t + C*t2 + D*t3 + E/t2
H° − H°298.15= A*t + B*t2/2 + C*t3/3 + D*t4/4 − E/t + F − H
S° = A*ln(t) + B*t + C*t2/2 + D*t3/3 − E/(2*t2) + G
    Cp = heat capacity (J/mol*K)
    H° = standard enthalpy (kJ/mol)
    S° = standard entropy (J/mol*K)
    t = temperature (K) / 1000.

View plot Requires a JavaScript / HTML 5 canvas capable browser.

View table.

Temperature (K) 298. - 980.980. - 1147.
A 39.30228292.8804
B 531.42660.000000
C -483.08880.000000
D 156.61510.000000
E -0.1776400.000000
F -2501.982-2609.594
G 72.30078416.4607
H -2470.070-2470.070
ReferenceChase, 1998Chase, 1998
Comment Data last reviewed in September, 1967 Data last reviewed in September, 1967

References

Chase, 1998
Chase, M.W., Jr., NIST-JANAF Themochemical Tables, Fourth Edition, J. Phys. Chem. Ref. Data, Monograph 9, 1998, 1-1951. [all data]