Dimethyldithiocarbamic acid,copper salt

Phase change data

Data compiled by: William E. Acree, Jr., James S. Chickos

Quantity Value Units Method Reference Comment
Δsub156.0 ± 0.3kJ/molCRibeiro da Silva, Reis, et al., 1995

Enthalpy of vaporization

ΔvapH (kJ/mol) Temperature (K) Reference Comment
147.4458.Dykyj, Svoboda, et al., 1999Based on data from 443. - 473. K.

Enthalpy of sublimation

ΔsubH (kJ/mol) Temperature (K) Method Reference Comment
147.4 ± 0.8458.AStephenson and Malanowski, 1987Based on data from 443. - 473. K. See also Tavlaridis and Neeb, 1978.

References

Ribeiro da Silva, Reis, et al., 1995
Ribeiro da Silva, M.A.V.; Reis, A.M.M.V.; Faria, R.I.M.C.P., Standard enthalpies of formation of crystalline dimethylammoniumdimethyldithiocarbamate and dimethyldithiocarbamate complexes of copper(II) and nickel(II). The mean Cu-S and Ni-S bond-dissociation enthalpies, J. Chem. Thermodyn., 1995, 27, 1365-1372. [all data]

Dykyj, Svoboda, et al., 1999
Dykyj, J.; Svoboda, J.; Wilhoit, R.C.; Frenkel, M.L.; Hall, K.R., Vapor Pressure of Chemicals: Part A. Vapor Pressure and Antoine Constants for Hydrocarbons and Sulfur, Selenium, Tellurium and Hydrogen Containing Organic Compounds, Springer, Berlin, 1999, 373. [all data]

Stephenson and Malanowski, 1987
Stephenson, Richard M.; Malanowski, Stanislaw, Handbook of the Thermodynamics of Organic Compounds, 1987, https://doi.org/10.1007/978-94-009-3173-2 . [all data]

Tavlaridis and Neeb, 1978
Tavlaridis, Athanassios; Neeb, Rolf, Dialkyldithiocarbamates as reagents for the gas-chromatographic determination of metals, Z. Anal. Chem., 1978, 293, 3, 211-219, https://doi.org/10.1007/BF00491050 . [all data]