germanium diiodide

Gas phase ion energetics data

Data compiled as indicated in comments:
LBLHLM - Sharon G. Lias, John E. Bartmess, Joel F. Liebman, John L. Holmes, Rhoda D. Levin, and W. Gary Mallard

Ionization energy determinations

IE (eV) Method Reference Comment
8.9PEJonkers, Van Der Kerk, et al., 1983LBLHLM
9.08 ± 0.03PEJonkers, Van Der Kerk, et al., 1983Vertical value; LBLHLM

References

Jonkers, Van Der Kerk, et al., 1983
Jonkers, G.; Van Der Kerk, S.M.; Mooyman, R.; De Lange, C.A.; Snijders, J.G., UV photoelectron apectroscopy of transient species: Germanium diiodide (GeI2), Chem. Phys. Lett., 1983, 94, 585. [all data]