disodium wolframate

Condensed phase thermochemistry data

Quantity Value Units Method Reference Comment
Δfsolid-1544.73kJ/molReviewChase, 1998Data last reviewed in June, 1967
Quantity Value Units Method Reference Comment
solid160.36J/mol*KReviewChase, 1998Data last reviewed in June, 1967

Solid Phase Heat Capacity (Shomate Equation)

Cp° = A + B*t + C*t2 + D*t3 + E/t2
H° − H°298.15= A*t + B*t2/2 + C*t3/3 + D*t4/4 − E/t + F − H
S° = A*ln(t) + B*t + C*t2/2 + D*t3/3 − E/(2*t2) + G
    Cp = heat capacity (J/mol*K)
    H° = standard enthalpy (kJ/mol)
    S° = standard entropy (J/mol*K)
    t = temperature (K) / 1000.

View plot Requires a JavaScript / HTML 5 canvas capable browser.

View table.

Temperature (K) 298. - 861.862. - 1500.
A 124.3290141.3400
B 100.563047.03900
C -15.1654042.63360
D 11.00500-10.88260
E -1.197420-0.872621
F -1590.170-1558.930
G 274.6740347.3660
H -1544.730-1544.730
ReferenceChase, 1998Chase, 1998
Comment Data last reviewed in June, 1967 Data last reviewed in June, 1967

References

Chase, 1998
Chase, M.W., Jr., NIST-JANAF Themochemical Tables, Fourth Edition, J. Phys. Chem. Ref. Data, Monograph 9, 1998, 1-1951. [all data]