2-Tetrazene, 1,1,4,4-tetrakis(1-methylethyl)-

Gas phase ion energetics data

Data compiled by: Sharon G. Lias, Rhoda D. Levin, and Sherif A. Kafafi

Ionization energy determinations

IE (eV) Method Reference Comment
6.9PEBischof, Gleiter, et al., 1975Vertical value

References

Bischof, Gleiter, et al., 1975
Bischof, P.; Gleiter, R.; Dach, R.; Enders, D.; Seebach, D., Zur Wechselwirkung einsamer Elektronenpaare in Δ2 Tetrazenen. Photoelektronenspektroskopische Untersuchungen, Tetrahedron, 1975, 31, 1415. [all data]