Cerium(III) oxalate

Condensed phase thermochemistry data

Data compiled by: Eugene S. Domalski and Elizabeth D. Hearing

Constant pressure heat capacity of solid

Cp,solid (J/mol*K) Temperature (K) Reference Comment
499.2418.Gallagher and Dworzak, 1985T = 298 to 773 K. Cp = 3.2177x101 - (1.9668x10-1)T + (4.0732x10-1)T2 - (2.7686x10-1)T3 J/g*K over the temperature range 418 to 538 K.

References

Gallagher and Dworzak, 1985
Gallagher, S.A.; Dworzak, W.R., Thermodynamic properties of cerium oxalate and cerium oxide, J. Am. Ceram. Soc., 1985, 68(8), C206-C207. [all data]