palladium monoxide

Gas phase ion energetics data

Data compiled as indicated in comments:
LL - Sharon G. Lias and Joel F. Liebman
RDSH - Henry M. Rosenstock, Keith Draxl, Bruce W. Steiner, and John T. Herron
B - John E. Bartmess

Electron affinity determinations

EA (eV) Method Reference Comment
1.6720 ± 0.0050LPESRamond, Davico, et al., 2002B
1.5700 ± 0.0060LPESKlopcic, Moravec, et al., 1999B

Ionization energy determinations

IE (eV) Method Reference Comment
9.76 ± 0.17END/DERChen and Armentrout, 1995LL
9.1EINorman, Staley, et al., 1964RDSH

References

Ramond, Davico, et al., 2002
Ramond, T.M.; Davico, G.E.; Hellberg, F.; Svedberg, F.; Salen, P.; Soderqvist, P.; Lineberger, W.C., Photoelectron spectroscopy of nickel, palladium, and platinum oxide anions, J. Molec. Spectros., 2002, 216, 1, 1-14, https://doi.org/10.1006/jmsp.2002.8669 . [all data]

Klopcic, Moravec, et al., 1999
Klopcic, S.A.; Moravec, V.D.; Jarrold, C.C., Photoelectron spectrum of PdO-, J. Chem. Phys., 1999, 110, 20, 10216-10217, https://doi.org/10.1063/1.478894 . [all data]

Chen and Armentrout, 1995
Chen, Y.-M.; Armentrout, P.B., Kinetic energy dependence of the reactions of Ru+, Rh+, Pd+, and Ag+ with O2, J. Chem. Phys., 1995, 103, 618. [all data]

Norman, Staley, et al., 1964
Norman, J.H.; Staley, H.G.; Bell, W.E., Mass spectrometric study of gaseous oxides of rhodium and palladium, J. Phys. Chem., 1964, 68, 662. [all data]