Chromium oxide

Condensed phase thermochemistry data

Quantity Value Units Method Reference Comment
Δfliquid-1018.38kJ/molReviewChase, 1998Data last reviewed in December, 1973
Quantity Value Units Method Reference Comment
liquid,1 bar125.57J/mol*KReviewChase, 1998Data last reviewed in December, 1973
Quantity Value Units Method Reference Comment
Δfsolid-1134.70kJ/molReviewChase, 1998Data last reviewed in December, 1973
Quantity Value Units Method Reference Comment
solid80.65J/mol*KReviewChase, 1998Data last reviewed in December, 1973

Liquid Phase Heat Capacity (Shomate Equation)

Cp° = A + B*t + C*t2 + D*t3 + E/t2
H° − H°298.15= A*t + B*t2/2 + C*t3/3 + D*t4/4 − E/t + F − H
S° = A*ln(t) + B*t + C*t2/2 + D*t3/3 − E/(2*t2) + G
    Cp = heat capacity (J/mol*K)
    H° = standard enthalpy (kJ/mol)
    S° = standard entropy (J/mol*K)
    t = temperature (K) / 1000.

View plot Requires a JavaScript / HTML 5 canvas capable browser.

View table.

Temperature (K) 2603. - 4500.
A 156.9000
B 0.000169
C -0.000035
D 0.000003
E 0.000369
F -1111.580
G 252.7170
H -1018.380
ReferenceChase, 1998
Comment Data last reviewed in December, 1973

Solid Phase Heat Capacity (Shomate Equation)

Cp° = A + B*t + C*t2 + D*t3 + E/t2
H° − H°298.15= A*t + B*t2/2 + C*t3/3 + D*t4/4 − E/t + F − H
S° = A*ln(t) + B*t + C*t2/2 + D*t3/3 − E/(2*t2) + G
    Cp = heat capacity (J/mol*K)
    H° = standard enthalpy (kJ/mol)
    S° = standard entropy (J/mol*K)
    t = temperature (K) / 1000.

View plot Requires a JavaScript / HTML 5 canvas capable browser.

View table.

Temperature (K) 298. - 305.305. - 2603.
A -147396.0124.6550
B 711495.0-0.337045
C -1.111270×10+65.705010
D 407561.0-1.053470
E 2077.160-2.030501
F 27167.10-1178.440
G -332949.0221.3300
H -1134.700-1134.700
ReferenceChase, 1998Chase, 1998
Comment Data last reviewed in December, 1973 Data last reviewed in December, 1973

References

Chase, 1998
Chase, M.W., Jr., NIST-JANAF Themochemical Tables, Fourth Edition, J. Phys. Chem. Ref. Data, Monograph 9, 1998, 1-1951. [all data]