9,10-Ethanoanthracene-11,12-dicarboxylic anhydride, 9,10-dihydro-11-isopropyl- (6CI)

Reaction thermochemistry data

Data compiled by: Hussein Y. Afeefy, Joel F. Liebman, and Stephen E. Stein

Individual Reactions

Anthracene + 2,5-Furnadione, 3-(1-methylethyl)- = C21H18O3

By formula: C14H10 + C7H8O3 = C21H18O3

Quantity Value Units Method Reference Comment
Δr-87.5kJ/molEqkLenz, Hegedus, et al., 1982liquid phase; solvent: 1,2,4-C6H3Cl3

References

Lenz, Hegedus, et al., 1982
Lenz, T.G.; Hegedus, L.S.; Vaughan, J.D., Liquid phase thermochemical energy conversion systems - an application of Diels-Alder chemistry, Int. J. Energy Res., 1982, 6, 357-365. [all data]