Citronellol

Kovats' RI, non-polar column, isothermal

View large format table.

Column type Active phase Temperature (C) I Reference Comment
CapillaryZB-1100.1208.15Hoskovec, Grygarová, et al., 200530. m/0.32 mm/1. μm, He
CapillaryZB-1110.1208.27Hoskovec, Grygarová, et al., 200530. m/0.32 mm/1. μm, He
CapillaryZB-1120.1208.61Hoskovec, Grygarová, et al., 200530. m/0.32 mm/1. μm, He
CapillaryZB-1130.1209.09Hoskovec, Grygarová, et al., 200530. m/0.32 mm/1. μm, He
CapillaryZB-1140.1209.73Hoskovec, Grygarová, et al., 200530. m/0.32 mm/1. μm, He
CapillaryZB-1150.1210.52Hoskovec, Grygarová, et al., 200530. m/0.32 mm/1. μm, He
CapillaryZB-1160.1211.44Hoskovec, Grygarová, et al., 200530. m/0.32 mm/1. μm, He
CapillaryZB-1170.1212.51Hoskovec, Grygarová, et al., 200530. m/0.32 mm/1. μm, He
CapillaryZB-1180.1213.78Hoskovec, Grygarová, et al., 200530. m/0.32 mm/1. μm, He
CapillaryZB-1190.1215.02Hoskovec, Grygarová, et al., 200530. m/0.32 mm/1. μm, He
CapillaryZB-1200.1216.54Hoskovec, Grygarová, et al., 200530. m/0.32 mm/1. μm, He
CapillaryZB-190.1208.2Hoskovec, Grygarová, et al., 200530. m/0.32 mm/1. μm, He
CapillaryZB-1100.1208.44Hoskovec, Grygarová, et al., 200530. m/0.32 mm/0.25 μm, He
CapillaryZB-1110.1208.49Hoskovec, Grygarová, et al., 200530. m/0.32 mm/0.25 μm, He
CapillaryZB-1120.1208.77Hoskovec, Grygarová, et al., 200530. m/0.32 mm/0.25 μm, He
CapillaryZB-1130.1209.17Hoskovec, Grygarová, et al., 200530. m/0.32 mm/0.25 μm, He
CapillaryZB-1140.1209.82Hoskovec, Grygarová, et al., 200530. m/0.32 mm/0.25 μm, He
CapillaryZB-1150.1210.54Hoskovec, Grygarová, et al., 200530. m/0.32 mm/0.25 μm, He
CapillaryZB-1160.1211.43Hoskovec, Grygarová, et al., 200530. m/0.32 mm/0.25 μm, He
CapillaryZB-1170.1212.46Hoskovec, Grygarová, et al., 200530. m/0.32 mm/0.25 μm, He
CapillaryZB-1180.1213.56Hoskovec, Grygarová, et al., 200530. m/0.32 mm/0.25 μm, He
CapillaryZB-170.1209.6Hoskovec, Grygarová, et al., 200530. m/0.32 mm/0.25 μm, He
CapillaryZB-180.1208.98Hoskovec, Grygarová, et al., 200530. m/0.32 mm/0.25 μm, He
CapillaryZB-190.1208.6Hoskovec, Grygarová, et al., 200530. m/0.32 mm/0.25 μm, He
CapillarySE-30100.1209.8Tudor, 199740. m/0.35 mm/0.35 μm
CapillaryHP-5100.1228.Hennig and Engewald, 199450. m/0.20 mm/0.33 μm, H2
CapillaryHP-5110.1228.Hennig and Engewald, 199450. m/0.20 mm/0.33 μm, H2
CapillaryHP-5120.1229.Hennig and Engewald, 199450. m/0.20 mm/0.33 μm, H2
CapillaryHP-5130.1229.Hennig and Engewald, 199450. m/0.20 mm/0.33 μm, H2
CapillaryHP-5140.1230.Hennig and Engewald, 199450. m/0.20 mm/0.33 μm, H2
CapillaryHP-5150.1230.Hennig and Engewald, 199450. m/0.20 mm/0.33 μm, H2
CapillaryHP-580.1228.Hennig and Engewald, 199450. m/0.20 mm/0.33 μm, H2
CapillaryHP-590.1228.Hennig and Engewald, 199450. m/0.20 mm/0.33 μm, H2
CapillaryHP-5100.1228.Hennig and Engewald, 199450. m/0.20 mm/0.11 μm, H2
CapillaryHP-5110.1229.Hennig and Engewald, 199450. m/0.20 mm/0.11 μm, H2
CapillaryHP-5120.1229.Hennig and Engewald, 199450. m/0.20 mm/0.11 μm, H2
CapillaryHP-5130.1229.Hennig and Engewald, 199450. m/0.20 mm/0.11 μm, H2
CapillaryHP-5140.1230.Hennig and Engewald, 199450. m/0.20 mm/0.11 μm, H2
CapillaryHP-5150.1231.Hennig and Engewald, 199450. m/0.20 mm/0.11 μm, H2
CapillaryHP-580.1229.Hennig and Engewald, 199450. m/0.20 mm/0.11 μm, H2
CapillaryHP-590.1229.Hennig and Engewald, 199450. m/0.20 mm/0.11 μm, H2
PackedSE-30140.1218.Pías and Gascó, 1975Ar, Chromosorb W AW DMCS HP (80-100 mesh); Column length: 1. m
PackedSE-30160.1225.Hedin, Thompson, et al., 1972N2, Chromosorb W; Column length: 6.145 m

Kovats' RI, non-polar column, temperature ramp

View large format table.

Column type Active phase I Reference Comment
CapillaryDB-51228.Adams, González Elizondo, et al., 200630. m/0.26 mm/0.25 μm, He, 3. K/min; Tstart: 60. C; Tend: 246. C
CapillaryHP-5MS1245.Jalali-Heravi, Zekavat, et al., 200660. m/0.25 mm/0.25 μm, He, 40. C @ 1. min, 3. K/min, 250. C @ 20. min
CapillaryDB-51228.Adams and Nguyen, 200530. m/0.26 mm/0.25 μm, He, 3. K/min; Tstart: 60. C; Tend: 246. C
CapillaryHP-5MS1232.Asuming, Beauchamp, et al., 200530. m/0.25 mm/0.25 μm, He, 50. C @ 10. min, 3. K/min, 250. C @ 5. min
CapillaryBP-11211.Rajeswara Rao, Kaul, et al., 200530. m/0.32 mm/0.25 μm, 5. K/min, 245. C @ 10. min; Tstart: 60. C
CapillaryBP-11211.Rao, Kaul, et al., 200530. m/0.32 mm/0.25 μm, 5. K/min, 245. C @ 10. min; Tstart: 60. C
CapillarySPB-51230.Gauvin, Lecomte, et al., 200460. m/0.32 mm/1. μm, He, 4. K/min, 200. C @ 30. min; Tstart: 60. C
CapillaryDB-51240.Baranauskiene, Venskutonis, et al., 200350. m/0.32 mm/0.25 μm, He, 50. C @ 2. min, 5. K/min, 280. C @ 10. min
CapillaryHP-5MS1217.Gkinis, Tzakou, et al., 200330. m/0.25 mm/0.25 μm, He, 3. K/min; Tstart: 60. C; Tend: 280. C
CapillaryHP-51232.Nickavar, Salehi-Sormagi, et al., 200230. m/0.25 mm/0.25 μm, He, 4. K/min; Tstart: 60. C; Tend: 275. C
CapillaryCross-Linked Methylsilicone1220.Rajeswara Rao, Kaul, et al., 200250. m/0.2 mm/0.25 μm, He, 4. K/min; Tstart: 100. C; Tend: 280. C
CapillaryBP-11215.Rajeswara Rao, 200225. m/0.5 mm/0.25 μm, N2, 5. K/min, 220. C @ 10. min; Tstart: 60. C
CapillaryBP-11215.Rao B.R.R., 200225. m/0.5 mm/0.25 μm, 5. K/min, 220. C @ 10. min; Tstart: 60. C
CapillaryBP-11220.Jain, Aggarwal, et al., 200125. m/0.55 mm/0.25 μm, N2, 5. K/min, 220. C @ 15. min; Tstart: 60. C
CapillaryHP-11212.Rajeswara Rao, 200125. m/0.2 mm/0.25 μm, He, 4. K/min; Tstart: 100. C; Tend: 220. C
CapillaryDB-11202.Abella, Cortella, et al., 200030. m/0.25 mm/0.25 μm, 4. K/min; Tstart: 80. C; Tend: 225. C
CapillarySE-541228.Adams, 200030. m/0.26 mm/0.25 μm, He, 3. K/min; Tstart: 60. C; Tend: 246. C
CapillaryDB-51228.Adams, 2000, 230. m/0.26 mm/0.25 μm, He, 3. K/min; Tstart: 60. C; Tend: 240. C
CapillarySE-541228.Adams, 2000, 330. m/0.26 mm/0.25 μm, 3. K/min; Tstart: 60. C; Tend: 246. C
CapillaryDB-51228.Adams, 2000, 430. m/0.26 mm/0.25 μm, He, 3. K/min; Tstart: 60. C; Tend: 246. C
CapillaryBP-11215.Rao, Kaul, et al., 2000N2, 5. K/min, 220. C @ 10. min; Column length: 25. m; Column diameter: 0.5 mm; Tstart: 60. C
CapillaryDB-51236.Rao, Rout, et al., 2000He, 2. K/min; Column length: 30. m; Column diameter: 0.25 mm; Tstart: 60. C; Tend: 180. C
CapillaryBP-11215.Rao, Sastry, et al., 200025. m/0.50 mm/0.25 μm, N2, 5. K/min, 220. C @ 10. min; Tstart: 60. C
CapillaryDB-51228.Adams, 199930. m/0.26 mm/0.25 μm, He, 3. K/min; Tstart: 60. C; Tend: 246. C
CapillaryCP Sil 5 CB1215.Kaul, Gujral, et al., 1999He, 5. K/min; Column length: 25. m; Column diameter: 0.25 mm; Tstart: 60. C; Tend: 280. C
CapillaryBP-11215.Kulkarni, Mallavarapu, et al., 1998N2, 5. K/min; Column length: 25. m; Column diameter: 0.25 mm; Tstart: 60. C; Tend: 220. C
CapillaryMethyl Silicone1213.Mallavarapu, Rao, et al., 1998N2, 5. K/min; Column length: 25. m; Column diameter: 0.5 mm; Tstart: 60. C; Tend: 220. C
CapillarySE-301216.Jantan, Ahmad, et al., 1996N2, 60. C @ 10. min, 3. K/min, 180. C @ 1. min; Column length: 25. m; Column diameter: 0.2 mm
CapillaryOV-1011210.Padrayuttawat, Tamura, et al., 199650. m/0.25 mm/0.2 μm, N2, 2. K/min, 200. C @ 60. min; Tstart: 80. C
CapillaryHP-11213.Raharivelomanana, Cambon, et al., 19936. K/min, 240. C @ 10. min; Column length: 15. m; Column diameter: 0.32 mm; Tstart: 40. C

Kovats' RI, non-polar column, custom temperature program

View large format table.

Column type Active phase I Reference Comment
CapillaryBP-11225.Raina, Srivastava, et al., 200325. m/0.32 mm/0.25 μm, N2; Program: 60C => 5C/min => 220C(5min) => 3C/min => 245C(5min)
CapillaryBP-11208.Rao, Kaul, et al., 200330. m/0.32 mm/0.25 μm, N2; Program: 60C => 5.5C/min => 220C => 3.5C/min => 245C
CapillaryHP-51228.Shellie and Marriott, 200330. m/0.25 mm/0.25 μm, He; Program: not specified
CapillaryDB-51228.Rao, Rout, et al., 2000He; Column length: 30. m; Column diameter: 0.25 mm; Program: not specified
CapillaryDB-51228.Adams, 199830. m/0.26 mm/0.25 μm; Program: not specified

Kovats' RI, polar column, isothermal

View large format table.

Column type Active phase Temperature (C) I Reference Comment
PackedCarbowax 20M150.1765.ter Heide, 1976
PackedPEG 4000175.1765.Hedin, Thompson, et al., 1972N2, Chromosorb P; Column length: 6.145 m
CapillaryCarbowax 20M + Igepal (20:1)135.1754.Sakai, Maarse, et al., 1967He, GAS PAK F; Column length: 152. m; Column diameter: 0.8 mm

Kovats' RI, polar column, temperature ramp

View large format table.

Column type Active phase I Reference Comment
CapillaryHP-Wax1782.Gauvin, Lecomte, et al., 200450. m/0.2 mm/0.4 μm, He, 4. K/min, 230. C @ 30. min; Tstart: 60. C
CapillaryCarbowax 20M1781.Kulkarni, Mallavarapu, et al., 1998N2, 5. K/min; Column length: 25. m; Column diameter: 0.25 mm; Tstart: 60. C; Tend: 200. C
CapillaryCarbowax 20M1755.Tressl, Friese, et al., 1978He, 2. K/min; Column length: 50. m; Column diameter: 0.28 mm; Tstart: 70. C; Tend: 190. C

Van Den Dool and Kratz RI, non-polar column, temperature ramp

View large format table.

Column type Active phase I Reference Comment
CapillaryHP-51231.Benzo, Gilardoni, et al., 200730. m/0.25 mm/0.25 μm, He, 40. C @ 1. min, 5. K/min, 250. C @ 10. min
CapillaryBP-11208.Boti, Koukoua, et al., 200750. m/0.22 mm/0.25 μm, He, 2. K/min, 220. C @ 20. min; Tstart: 60. C
CapillaryBP-11207.Duquesnoy, Castola, et al., 200750. m/0.22 mm/0.25 μm, He, 2. K/min, 220. C @ 20. min; Tstart: 60. C
CapillaryDB-51227.Hongratanaworakit and Buchbauer, 200730. m/0.25 mm/0.25 μm, He, 3. K/min; Tstart: 60. C; Tend: 246. C
CapillarySLB-5MS1225.Mondello, Sciarrone, et al., 200710. m/0.1 mm/0.1 μm, 40. K/min; Tstart: 40. C; Tend: 250. C
CapillarySLB-5MS1233.Mondello, Sciarrone, et al., 200710. m/0.1 mm/0.1 μm, 40. K/min; Tstart: 40. C; Tend: 250. C
CapillarySLB-5MS1235.Mondello, Sciarrone, et al., 200710. m/0.1 mm/0.1 μm, 40. K/min; Tstart: 40. C; Tend: 250. C
CapillaryEquity-51234.Rocha, Coelho, et al., 200760. m/0.25 mm/1. μm, He, 40. C @ 1. min, 5. K/min, 260. C @ 15. min
CapillaryBP-11208.Gonny, Cavaleiro, et al., 200650. m/0.22 mm/0.25 μm, He, 2. K/min, 220. C @ 20. min; Tstart: 60. C
CapillaryHP-5MS1221.Kukic J., Petrovic S., et al., 200630. m/0.25 mm/0.25 μm, He, 3. K/min; Tstart: 60. C; Tend: 280. C
CapillaryDB-51226.Su, Ho, et al., 200630. m/0.25 mm/0.25 μm, He, 50. C @ 2. min, 5. K/min; Tend: 250. C
CapillaryMDN-51224.Dugo, Mondello, et al., 200530. m/0.25 mm/0.25 μm, He, 3. K/min; Tstart: 50. C; Tend: 250. C
CapillaryDB-11213.Fanciullino, Gancel, et al., 200530. m/0.25 mm/0.25 μm, He, 3. K/min, 250. C @ 20. min; Tstart: 40. C
CapillaryDB-11214.Gancel, Ollitrault, et al., 200530. m/0.25 mm/0.25 μm, He, 3. K/min, 250. C @ 20. min; Tstart: 40. C
CapillaryHP-5MS1236.Smadja, Rondeau, et al., 200560. m/0.2 mm/0.25 μm, He, 2. K/min, 200. C @ 10. min; Tstart: 60. C
CapillaryZB-51232.Bell, 200430. m/0.32 mm/0.50 μm, Helium, 7. K/min, 265. C @ 5. min; Tstart: 40. C
CapillaryHP-51215.Bertoli, Pistelli, et al., 200430. m/0.25 mm/0.25 μm, N2, 60. C @ 10. min, 5. K/min; Tend: 220. C
CapillaryRTX-51229.Dugo, Mondello, et al., 200430. m/0.25 mm/0.25 μm, He, 45. C @ 6. min, 3. K/min, 300. C @ 10. min
CapillaryZB-51238.Gocmen, Gurbuz, et al., 20040. m/0.32 mm/0.5 μm, 7. K/min, 265. C @ 5. min; Tstart: 40. C
CapillaryHP-51229.Isidorov, Krajewska, et al., 200430. m/0.25 mm/0.25 μm, He, 3. K/min; Tstart: 40. C; Tend: 250. C
CapillaryDB-5MS1231.Mardarowicz, Wianowska, et al., 200430. m/0.25 mm/0.25 μm, He, 40. C @ 2. min, 4. K/min; Tend: 280. C
CapillaryBP-11212.Raina, Kumar, et al., 200430. m/0.32 mm/0.25 μm, N2, 5. K/min, 220. C @ 13. min; Tstart: 60. C
CapillaryHP-51224.Stashenko, Jaramillo, et al., 200450. m/0.2 mm/0.2 μm, He, 40. C @ 15. min, 3. K/min, 250. C @ 40. min
CapillaryDB-5MS1237.Yu, Kim, et al., 200430. m/0.25 mm/0.25 μm, He, 40. C @ 5. min, 4. K/min, 200. C @ 20. min
CapillarySPB-11210.Cavaleiro, Salgueiro, et al., 200330. m/0.2 mm/0.2 μm, He, 3. K/min, 220. C @ 15. min; Tstart: 70. C
CapillarySPB-11212.Chisholm, Jell, et al., 200330. m/0.25 mm/0.25 μm, He, 35. C @ 5. min, 4. K/min, 225. C @ 20. min
CapillarySPB-11213.Chisholm, Wilson, et al., 200325. m/0.25 mm/0.25 μm, 35. C @ 10. min, 4. K/min; Tend: 225. C
CapillarySPB-11213.Chisholm, Wilson, et al., 200325. m/0.25 mm/0.25 μm, 35. C @ 10. min, 4. K/min; Tend: 225. C
CapillaryDB-11214.Gancel, Ollitrault, et al., 200330. m/0.25 mm/0.25 μm, He, 3. K/min, 250. C @ 20. min; Tstart: 40. C
CapillaryDB-51233.Högnadóttir and Rouseff, 200330. m/0.32 mm/0.5 μm, 7. K/min, 265. C @ 5. min; Tstart: 40. C
CapillaryHP-51236.Shellie and Marriott, 200330. m/0.25 mm/0.25 μm, He, 3. K/min; Tstart: 40. C; Tend: 240. C
CapillaryDB-11209.0Sun and Stremple, 200330. m/0.25 mm/0.25 μm, He, 3. K/min; Tstart: 40. C; Tend: 325. C
CapillaryMega 5MS1222.Verzera, Trozzi, et al., 200330. m/0.25 mm/0.25 μm, He, 40. C @ 2. min, 3. K/min; Tend: 240. C
CapillaryBP-11207.Lota, de Rocca Serra, et al., 200250. m/0.22 mm/0.25 μm, He, 2. K/min, 220. C @ 20. min; Tstart: 60. C
CapillaryRTX-51235.Mondello, Zappia, et al., 200230. m/0.25 mm/0.25 μm, He, 45. C @ 6. min, 3. K/min, 300. C @ 10. min
CapillaryHP-11210.Nath, Sarma, et al., 200224. m/0.32 mm/0.17 μm, He, 60. C @ 2. min, 4. K/min, 250. C @ 20. min
CapillaryDB-11208.Pintore, Usai, et al., 200250. m/0.22 mm/0.25 μm, He, 2. K/min, 220. C @ 20. min; Tstart: 60. C
CapillaryRTX-5 MS1220.Hudaib, Grazia Bellardi, et al., 200130. m/0.25 mm/0.25 μm, He, 70. C @ 10. min, 4. K/min, 210. C @ 10. min
CapillaryDB-11225.Lin and Rouseff, 200130. m/0.32 mm/0.25 μm, 7. K/min, 240. C @ 5. min; Tstart: 40. C
CapillaryBP-11207.Lota, Serra, et al., 200150. m/0.22 mm/0.25 μm, He, 2. K/min; Tstart: 60. C; Tend: 220. C
CapillaryBP-11208.Rezzi, Cavaleiro, et al., 200150. m/0.22 mm/0.25 μm, 2. K/min, 220. C @ 20. min; Tstart: 60. C
CapillaryHP-51224.Alonzo, Bosco, et al., 200030. m/0.20 mm/0.25 μm, He, 60. C @ 8. min, 4. K/min, 180. C @ 2. min
CapillaryDB-51212.Bartley and Jacobs, 200060. m/0.25 mm/0.25 μm, He, 40. C @ 2. min, 4. K/min, 290. C @ 5. min
CapillaryBP-11207.Lota, de Rocca Serra, et al., 200050. m/0.22 mm/0.25 μm, He, 2. K/min, 230. C @ 35. min; Tstart: 60. C
CapillaryBP-11207.Lota, de Rocca Serra, et al., 200050. m/0.22 mm/0.25 μm, He, 2. K/min, 230. C @ 35. min; Tstart: 60. C
CapillarySE-301218.Paramonov, Khalilova, et al., 20006. K/min; Column length: 50. m; Column diameter: 0.2 mm; Tstart: 50. C; Tend: 250. C
CapillaryMega 5MS1222.Verzera, la Rosa, et al., 200030. m/0.25 mm/0.25 μm, He, 40. C @ 2. min, 3. K/min; Tend: 240. C
CapillaryMega 5MS1222.Verzera, Trozzi, et al., 200030. m/0.25 mm/0.25 μm, He, 40. C @ 2. min, 3. K/min; Tend: 240. C
CapillaryDB-5MS1225.Chassagne, Boulanger, et al., 199930. m/0.25 mm/0.25 μm, H2, 2. K/min; Tstart: 40. C; Tend: 200. C
CapillaryBP-11207.Lota, Serra, et al., 199950. m/0.22 mm/0.25 μm, He, 2. K/min, 230. C @ 35. min; Tstart: 60. C
CapillaryCP Sil 5 CB1212.Weyerstahl, Marschall, et al., 1999He, 5. K/min; Column length: 25. m; Column diameter: 0.25 mm; Tstart: 60. C; Tend: 260. C
CapillaryMethyl Silicone1215.Píry, Príbela, et al., 199525. m/0.2 mm/0.3 μm, He, 2. K/min; Tstart: 40. C; Tend: 200. C
CapillaryHP-1011229.Chung, Eiserich, et al., 1993N2, 3. K/min; Column length: 50. m; Column diameter: 0.25 mm; Tstart: 70. C; Tend: 200. C
CapillaryOV-1011209.Yang, Sugisawa, et al., 1992N2, 2. K/min; Column length: 50. m; Column diameter: 0.25 mm; Tstart: 80. C; Tend: 200. C
CapillaryOV-1011209.Yang, Sugisawa, et al., 1992N2, 2. K/min; Column length: 50. m; Column diameter: 0.25 mm; Tstart: 80. C; Tend: 200. C
CapillaryDB-11211.7Chang, Sheng, et al., 19892. K/min; Column length: 30. m; Column diameter: 0.25 mm; Tstart: 50. C; Tend: 300. C
CapillaryDB-11214.4Chang, Sheng, et al., 19892. K/min; Column length: 30. m; Column diameter: 0.25 mm; Tstart: 50. C; Tend: 300. C
CapillaryOV-1011208.Pieribattesti, Smadja, et al., 1988H2, 2. K/min; Column length: 50. m; Column diameter: 0.32 mm; Tstart: 50. C; Tend: 200. C
CapillaryCP Sil 5 CB1206.Halket and Schulten, 198526. m/0.32 mm/1.25 μm, 10. K/min; Tstart: 100. C; Tend: 250. C
CapillaryCP Sil 5 CB1211.Halket and Schulten, 198526. m/0.32 mm/1.25 μm, 10. K/min; Tstart: 100. C; Tend: 250. C

Van Den Dool and Kratz RI, non-polar column, custom temperature program

View large format table.

Column type Active phase I Reference Comment
CapillaryHP-5MS1228.5Andriamaharavo, 201430. m/0.25 mm/0.25 μm, He; Program: 60C (1 min) => 5 C/min => 210C => 10 C/min => 280C (15 min)
CapillaryVF-5MS1232.9Tret'yakov, 200830. m/0.25 mm/0.25 μm, He; Program: Multi-step temperature program; T(initial)=60C; T(final)=270C
CapillaryBPX-51237.Dharmawan, Kasapis, et al., 200730. m/0.25 mm/0.25 μm, He; Program: 35C => 4C/min => 200C => 30C/min => 300C (3min)
CapillarySLB-5MS1232.Mondello, Sciarrone, et al., 200730. m/0.25 mm/0.25 μm; Program: not specified
CapillaryVF-5MS1229.3Tret'yakov, 200730. m/0.25 mm/0.25 μm, He; Program: Multi-step temperature program; T(initial)=60C; T(final)=270C
CapillaryBPX-51238.Mondello, Casilli, et al., 200530. m/0.25 mm/0.25 μm, He; Program: 50C => 1.5C/min => 230C => 15C/min => 260C
Capillary5 % Phenyl methyl siloxane1226.Sacchetti, Maietti, et al., 200530. m/0.32 mm/0.15 μm, He; Program: 45C => 1C/min => 100C => 5C/min => 250C (10min)
CapillaryDB-51237.Wang, Finn, et al., 200530. m/0.32 mm/1. μm, He; Program: 40C(2min) => 5C/min => 100C => 4C/min => 230C (10min)
CapillarySE-521229.Frizzo, Lorenzo, et al., 200425. m/0.32 mm/0.43 μm, H2; Program: 60C(8min) => 3C/min => 180C => 20C/min => 250C(10min)
CapillarySE-521228.Lorenzo, Loayza, et al., 200325. m/0.25 mm/0.25 μm, He; Program: 60C(8min) => 3C/min => 180C => 20C/min => 230C
CapillaryDB-5MS1228.Boulanger and Crouzet, 200030. m/0.25 mm/0.25 μm, H2/N2; Program: 40C (5min) => 2C/min => 200C => 5C/min => 250C (15min)
CapillarySE-521231.Lorenzo, Dellacassa, et al., 200025. m/0.25 mm/0.25 μm, He; Program: 60C(8min) => 3C/min => 180C => 20C/min => 230C
CapillaryDB-51223.Boulanger, Chassagne, et al., 199930. m/0.25 mm/0.25 μm, H2; Program: 40C(5min) => 2C/min => 220C => 5C/min => 250C(15min)
CapillaryDB-51228.Boulanger, Chassagne, et al., 199930. m/0.25 mm/0.25 μm, H2; Program: 40C(5min) => 2C/min => 220C => 5C/min => 250C(15min)
CapillaryDB-51221.Boulanger, Chassagne, et al., 199930. m/0.25 mm/0.25 μm, H2; Program: 40C(5min) => 2C/min => 220C => 5C/min => 250C(15min)
CapillaryDB-51223.Boulanger, Chassagne, et al., 199930. m/0.25 mm/0.25 μm, H2; Program: 40C(5min) => 2C/min => 220C => 5C/min => 250C(15min)
CapillarySE-541231.Tairu, Hofmann, et al., 199930. m/0.32 mm/0.25 μm, He; Program: 35C (2min) => 40C/min => 60C (2min) => 6C/min => 180C => 10C/min => 230C (5min)
CapillarySE-541231.Tairu, Hofmann, et al., 1999, 230. m/0.32 mm/0.25 μm, He; Program: 35 0C 40 0C/min -> 60 0C (2 min) 6 0C/min -> 180 0C 10 0C/min -> 230 0C
CapillarySE-521224.Mondello, Dugo, et al., 199560. m/0.32 mm/0.40 μm, He; Program: 45 C (6 min) 3 C/min -> 111 0C 2 C/min -> 160 C 3 C/min -> 300 C (15 min)

Van Den Dool and Kratz RI, polar column, temperature ramp

View large format table.

Column type Active phase I Reference Comment
CapillaryBP-201762.Boti, Koukoua, et al., 200750. m/0.22 mm/0.25 μm, He, 2. K/min, 220. C @ 20. min; Tstart: 60. C
CapillaryBP-201765.Duquesnoy, Castola, et al., 200750. m/0.22 mm/0.25 μm, He, 2. K/min, 220. C @ 20. min; Tstart: 60. C
CapillaryBP-201761.Gonny, Cavaleiro, et al., 200650. m/0.22 mm/0.25 μm, He, 2. K/min, 220. C @ 20. min; Tstart: 60. C
CapillaryZB-Wax1769.Ugliano, Bartowsky, et al., 200630. m/0.25 mm/0.25 μm, He, 50. C @ 1. min, 4. K/min, 220. C @ 10. min
CapillaryDB-Wax1750.Varming, Andersen, et al., 200630. m/0.25 mm/0.25 μm, He, 40. C @ 10. min, 6. K/min, 240. C @ 25. min
CapillaryDB-Wax1771.Choi, 200560. m/0.25 mm/0.25 μm, N2, 70. C @ 2. min, 2. K/min, 230. C @ 20. min
CapillaryDB-Wax1755.Fanciullino, Gancel, et al., 200530. m/0.25 mm/0.25 μm, He, 3. K/min, 250. C @ 20. min; Tstart: 40. C
CapillaryStabilwax1760.Fang and Qian, 200530. m/0.32 mm/1. μm, N2, 40. C @ 2. min, 4. K/min, 230. C @ 10. min
CapillaryDB-Wax1757.Gancel, Ollitrault, et al., 200530. m/0.25 mm/0.25 μm, He, 3. K/min, 250. C @ 20. min; Tstart: 40. C
CapillaryInnowax1717.Pena, Barciela, et al., 200530. m/0.25 mm/0.25 μm, He, 40. C @ 5. min, 5. K/min, 200. C @ 2. min
CapillaryDB-Wax1773.Bell, 200430. m/0.32 mm/0.50 μm, Helium, 7. K/min, 240. C @ 5. min; Tstart: 40. C
CapillaryHP-Wax1722.Bertoli, Pistelli, et al., 200430. m/0.25 mm/0.25 μm, N2, 60. C @ 10. min, 5. K/min; Tend: 220. C
CapillaryDB-Wax1774.Brophy, Goldsack, et al., 200460. m/0.32 mm/0.25 μm, He, 3. K/min; Tstart: 32. C; Tend: 220. C
CapillaryRTX-Wax1752.Dugo, Mondello, et al., 200430. m/0.25 mm/0.25 μm, He, 45. C @ 6. min, 3. K/min, 240. C @ 10. min
CapillaryZB-Wax1768.Ledauphin, Saint-Clair, et al., 200430. m/0.25 mm/0.15 μm, He, 35. C @ 10. min, 1.8 K/min, 220. C @ 10. min
CapillaryInnowax1779.Chisholm, Jell, et al., 200315. m/0.25 mm/0.25 μm, He, 35. C @ 5. min, 4. K/min, 225. C @ 20. min
CapillarySupelcowax1775.Chisholm, Wilson, et al., 200325. m/0.25 mm/0.25 μm, 35. C @ 5. min, 4. K/min, 225. C @ 10. min
CapillarySupelcowax1775.Chisholm, Wilson, et al., 200325. m/0.25 mm/0.25 μm, 35. C @ 5. min, 4. K/min, 225. C @ 10. min
CapillaryDB-Wax1771.Choi, 200360. m/0.25 mm/0.25 μm, N2, 70. C @ 2. min, 2. K/min, 230. C @ 20. min
CapillaryDB-Wax1754.Chyau, Ko, et al., 200360. m/0.25 mm/0.25 μm, He, 2. K/min, 210. C @ 40. min; Tstart: 40. C
CapillaryDB-Wax1757.Gancel, Ollitrault, et al., 200360. m/0.32 mm/0.25 μm, H2, 1.5 K/min, 245. C @ 20. min; Tstart: 40. C
CapillaryDB-Wax1773.Högnadóttir and Rouseff, 200330. m/0.32 mm/0.5 μm, 7. K/min, 240. C @ 5. min; Tstart: 40. C
CapillaryDB-Wax1767.Choi, Kim. M.-S.L., et al., 200260. m/0.25 mm/0.25 μm, N2, 2. K/min, 230. C @ 20. min; Tstart: 70. C
CapillaryDB-Wax1786.Claudela, Dirningera, et al., 200260. m/0.32 mm/0.5 μm, He, 2.7 K/min, 235. C @ 30. min; Tstart: 67. C
CapillaryBP-201756.Lota, de Rocca Serra, et al., 200250. m/0.22 mm/0.25 μm, He, 2. K/min, 220. C @ 20. min; Tstart: 60. C
CapillaryBP-201755.Pintore, Usai, et al., 200250. m/0.22 mm/0.25 μm, 2. K/min, 220. C @ 20. min; Tstart: 60. C
CapillaryDB-Wax1774.Lin and Rouseff, 200130. m/0.32 mm/0.50 μm, He, 7. K/min, 240. C @ 5. min; Tstart: 40. C
CapillaryBP-201756.Lota, Serra, et al., 200150. m/0.22 mm/0.25 μm, He, 2. K/min; Tstart: 60. C; Tend: 220. C
CapillaryDB-Wax1773.6Pet'ka, Mocák, et al., 200130. m/0.32 mm/0.25 μm, H2, 35. C @ 0.5 min, 4. K/min; Tend: 220. C
CapillaryDB-Wax1760.Wirth, Guo, et al., 200130. m/0.32 mm/0.5 μm, He, 60. C @ 3. min, 3. K/min, 245. C @ 20. min
CapillaryDB-Wax1730.Bartley and Jacobs, 200060. m/0.5 mm/0.32 μm, He, 40. C @ 2. min, 4. K/min, 290. C @ 5. min
CapillaryDB-Wax1770.Brophy, Goldsack, et al., 200060. m/0.53 mm/1.0 μm, He, 3. K/min; Tstart: 50. C; Tend: 220. C
CapillaryDB-Wax1765.Bureau, Razungles, et al., 200030. m/0.32 mm/0.5 μm, 60. C @ 3. min, 3. K/min, 245. C @ 20. min
CapillaryDB-Wax1772.Choi and Sawamura, 200060. m/0.25 mm/0.25 μm, N2, 70. C @ 2. min, 2. K/min, 230. C @ 20. min
CapillaryBP-201756.Lota, de Rocca Serra, et al., 200050. m/0.22 mm/0.25 μm, He, 2. K/min, 230. C @ 35. min; Tstart: 60. C
CapillaryBP-201756.Lota, de Rocca Serra, et al., 200050. m/0.22 mm/0.25 μm, He, 2. K/min, 230. C @ 35. min; Tstart: 60. C
CapillaryDB-Wax1770.Brophy, Goldsack, et al., 1999He, 3. K/min; Column length: 60. m; Column diameter: 0.53 mm; Tstart: 50. C; Tend: 220. C
CapillaryDB-Wax1760.Chassagne, Boulanger, et al., 199930. m/0.25 mm/0.25 μm, H2, 60. C @ 3. min, 2. K/min; Tend: 220. C
CapillaryBP-201756.Lota, Serra, et al., 199950. m/0.22 mm/0.25 μm, He, 2. K/min, 230. C @ 35. min; Tstart: 60. C
CapillarySP-10001770.Brophy, Forster, et al., 1998He, 3. K/min; Column length: 85. m; Column diameter: 0.5 mm; Tstart: 60. C; Tend: 225. C
CapillaryDB-Wax1763.Cha, Kim, et al., 199860. m/0.25 mm/0.25 μm, 40. C @ 5. min, 3. K/min, 200. C @ 60. min
CapillaryDB-Wax1759.Möllenbeck, König, et al., 199725. m/0.25 mm/0.25 μm, He, 50. C @ 3. min, 4. K/min; Tend: 240. C
CapillaryCarbowax 20M1747.Mondello, Dugo, et al., 199560. m/0.32 mm/0.425 μm, He, 45. C @ 3. min, 3. K/min, 300. C @ 20. min
CapillaryCarbowax 20M1719.Píry, Príbela, et al., 199550. m/0.2 mm/0.2 μm, He, 30. C @ 2. min, 4. K/min, 170. C @ 20. min
CapillaryHP-20M1737.Chung, Eiserich, et al., 1993He, 3. K/min; Column length: 50. m; Column diameter: 0.25 mm; Tstart: 60. C; Tend: 190. C
CapillaryHP-FFAP1781.Chung, Eiserich, et al., 1993He, 3. K/min; Column length: 50. m; Column diameter: 0.25 mm; Tstart: 60. C; Tend: 210. C
CapillaryDB-Wax1748.Humpf and Schreier, 199130. m/0.25 mm/0.25 μm, He, 50. C @ 3. min, 4. K/min, 220. C @ 20. min
CapillaryDB-Wax1777.Frohlich and Schreier, 199030. m/0.32 mm/0.25 μm, He, 40. C @ 3. min, 5. K/min; Tend: 220. C
CapillaryDB-Wax1771.Le Quere and Latrasse, 199030. m/0.32 mm/0.5 μm, He, 3. K/min; Tstart: 40. C; Tend: 220. C
CapillaryDB-Wax1760.7Chang, Sheng, et al., 19892. K/min; Column length: 30. m; Column diameter: 0.25 mm; Tstart: 50. C; Tend: 240. C
CapillaryDB-Wax1762.6Chang, Sheng, et al., 19892. K/min; Column length: 30. m; Column diameter: 0.25 mm; Tstart: 50. C; Tend: 240. C
CapillaryDB-Wax1777.Fröhlich, Duque, et al., 198930. m/0.25 mm/0.25 μm, He, 50. C @ 3. min, 4. K/min; Tend: 250. C
CapillaryDB-Wax1778.Fröhlich, Duque, et al., 198930. m/0.25 mm/0.25 μm, He, 50. C @ 3. min, 4. K/min; Tend: 250. C
CapillaryCarbowax 20M1769.Chen and Ho, 1988He, 1.5 K/min, 225. C @ 80. min; Column length: 60. m; Column diameter: 0.32 mm; Tstart: 50. C

Van Den Dool and Kratz RI, polar column, custom temperature program

View large format table.

Column type Active phase I Reference Comment
CapillaryDB-Wax1737.Selli, Canbas, et al., 200630. m/0.32 mm/0.5 μm, H2; Program: 60C(3min) => 2C/min => 220C => 3C/min => 245C (20min)
CapillarySOLGel-Wax1746.Aubert, Baumann, et al., 200530. m/0.25 mm/0.25 μm, He; Program: 35C(5min) => 3C/min => 150C => 5C/min => 250C(10 min)
CapillarySOLGel-Wax1746.Aubert, Baumann, et al., 200530. m/0.25 mm/0.25 μm, He; Program: 35C(5min) => 3C/min => 150C => 5C/min => 250C (10min)
CapillaryDB-Wax1790.Elston, Lin, et al., 2005Program: not specified
CapillarySupelcowax-101767.Howard, Mike, et al., 200530. m/0.25 mm/0.25 μm, He; Program: 35C(8min) => 3C/min => 134C => 20C/min => 250C(3.2min)
CapillaryStabilwax1803.Wang, Finn, et al., 200530. m/0.32 mm/1. μm, He; Program: 40C(2min) => 5C/min => 100C => 4C/min => 230C (10min)
CapillaryDB-Wax1758.Ferrari, Lablanquie, et al., 200460. m/0.25 mm/0.25 μm, He; Program: 35C(0.7min) => 20C/min => 70C => 4C/min => 240C
CapillaryDB-Wax1767.Selli, Cabaroglu, et al., 200430. m/0.32 mm/0.5 μm, H2; Program: 60C(3min) => 2C/min => 220C => 3C/min => 245C (20min)
CapillaryBP-201761.Lorenzo, Loayza, et al., 200325. m/0.25 mm/0.25 μm, He; Program: 40C(8min) => 3C/min => 180C => 20C/min => 230C
CapillarySupelcowax-101735.da Porto, Pizzale, et al., 200330. m/0.32 mm/0.3 μm; Program: 60C(8min) => 8C/min => 170C => 13C/min => 240C(20min)
CapillaryDB-Wax1755.Boulanger and Crouzet, 200030. m/0.25 mm/0.25 μm, H2; Program: 60C(3min) => 2C/min => 220C => 5C/min => 250C (15min)
CapillaryCarbowax 20M1740.Lorenzo, Dellacassa, et al., 2000Program: not specified
CapillaryFFAP1762.Tairu, Hofmann, et al., 199930. m/0.32 mm/0.25 μm, He; Program: 35C (2min) => 40C/min => 60C (2min) => 6C/min => 180C => 10C/min => 230C (5min)

Normal alkane RI, non-polar column, temperature ramp

View large format table.

Column type Active phase I Reference Comment
CapillaryHP-51225.Bertuzzi, Tirillini, et al., 201330. m/0.25 mm/0.25 μm, Helium, 60. C @ 3. min, 4. K/min, 300. C @ 15. min
CapillaryRTX-5 MS1236.Pinheiro, de Queiros, et al., 2013Helium, 3. K/min; Column length: 30. m; Column diameter: 0.25 mm; Tstart: 60. C; Tend: 240. C
CapillaryRTX-11213.Bendiabdellah, El Amine Dib, et al., 201260. m/0.22 mm/0.25 μm, Helium, 2. K/min, 230. C @ 5. min; Tstart: 60. C
CapillaryRTX-11213.Bendiabdellah, El Amine Dib, et al., 201260. m/0.22 mm/0.25 μm, Helium, 2. K/min, 230. C @ 5. min; Tstart: 60. C
CapillaryDB-51237.Boukhris, Bouaziz, et al., 201230. m/0.25 mm/0.25 μm, Helium, 100. C @ 1. min, 10. K/min, 260. C @ 10. min
CapillaryCP-Sil 5 CB1226.Ameen, Usman, et al., 201125. m/0.25 mm/0.15 μm, Helium; Tstart: 50. C; Tend: 220. C
CapillaryHP-5 MS1266.Zarai, Kadri, et al., 201130. m/0.25 mm/0.25 μm, Helium, 30. C @ 3. min, 5. K/min, 250. C @ 10. min
CapillaryDB-5 MS1227.Chalchat, Figueredo, et al., 201025. m/0.30 mm/0.25 μm, Helium, 3. K/min; Tstart: 50. C; Tend: 240. C
CapillaryBP-11210.Mishra, Chaudhary, et al., 2010Nitrogen, 60. C @ 10. min, 5. K/min, 220. C @ 30. min
CapillaryDB-11216.Safaei-Ghomi, Meshkatalsadat, et al., 201060. m/0.25 mm/0.25 μm, Nitrogen, 60. C @ 1. min, 4. K/min, 250. C @ 10. min
CapillaryZB-51212.Gardini, Beletti, et al., 200930. m/0.25 mm/0.25 μm, Helium, 3. K/min, 240. C @ 1. min; Tstart: 50. C
CapillaryDB-51228.Kazemi and Akhavani, 200950. m/0.20 mm/0.32 μm, Nitrogen, 60. C @ 3. min, 5. K/min; Tend: 220. C
CapillaryDB-5 MS1226.Koba, Sanda, et al., 200930. m/0.25 mm/0.25 μm, Helium, 50. C @ 5. min, 2. K/min; Tend: 250. C
CapillaryDB-1 MS1209.Seo, Kim, et al., 200930. m/0.25 mm/0.25 μm, Helium, 40. C @ 1. min, 6. K/min, 250. C @ 4. min
CapillaryBPX-51233.Bieri and Marriott, 200830. m/0.25 mm/0.25 μm, Hydrogen, 3. K/min; Tstart: 100. C; Tend: 999. C
CapillaryBPX-51234.Bieri and Marriott, 200830. m/0.25 mm/0.25 μm, Hydrogen, 3. K/min; Tstart: 60. C; Tend: 999. C
CapillaryBPX-51235.Bieri and Marriott, 200830. m/0.25 mm/0.25 μm, Hydrogen, 3. K/min; Tstart: 60. C; Tend: 999. C
CapillaryBPX-51235.Bieri and Marriott, 200830. m/0.25 mm/0.25 μm, Hydrogen, 3. K/min; Tstart: 60. C; Tend: 999. C
CapillaryBPX-51237.Bieri and Marriott, 200830. m/0.25 mm/0.25 μm, Hydrogen, 3. K/min; Tstart: 60. C; Tend: 999. C
CapillaryBPX-51235.Bieri and Marriott, 200830. m/0.25 mm/0.25 μm, Hydrogen, 5. K/min; Tstart: 60. C; Tend: 999. C
CapillarySLB-5 MS1226.Lo Presti, Sciarrone, et al., 200830. m/0.25 mm/0.25 μm, Helium, 50. C @ 2. min, 3. K/min, 250. C @ 10. min
CapillaryEquity-5 MS1232.Mondello, Casilli, et al., 200830. m/0.25 mm/0.25 μm, Helium, 1.5 K/min; Tstart: 40. C; Tend: 260. C
CapillaryHP-51228.Saeidnia and Hadjiakhoondi, 200830. m/0.25 mm/0.25 μm, Nitrogen, 100. C @ 1. min, 5. K/min, 200. C @ 15. min
CapillaryOV-11225.Wang, Yi, et al., 200830. m/0.25 mm/0.25 μm, Helium, 6. K/min; Tstart: 65. C; Tend: 260. C
CapillaryOV-11243.Wang, Yi, et al., 200830. m/0.25 mm/0.25 μm, Helium, 6. K/min; Tstart: 65. C; Tend: 260. C
CapillaryHP-5 MS1228.Adams, Beauchamp, et al., 200730. m/0.25 mm/0.25 μm, Helium, 50. C @ 10. min, 3. K/min, 230. C @ 10. min
CapillaryHP-51228.Cheraif, Ben Jannet, et al., 200730. m/0.25 mm/0.25 μm, N2, 50. C @ 1. min, 5. K/min, 240. C @ 4. min
CapillaryDB-51234.El-Ghorab A., El-Massry K.F., et al., 200730. m/0.25 mm/0.25 μm, He, 3. K/min, 220. C @ 40. min; Tstart: 35. C
CapillaryHP-5MS1227.Ferhat, Tigrine-Kordjani, et al., 200730. m/0.25 mm/0.25 μm, He, 60. C @ 8. min, 2. K/min, 250. C @ 15. min
CapillaryHP-5 MS1212.Loghmani-Khouzani, Fini, et al., 200730. m/0.25 mm/0.25 μm, Helium, 6. K/min; Tstart: 60. C; Tend: 220. C
CapillaryHP-5 MS1228.Loghmani-Khouzani, Fini, et al., 200730. m/0.25 mm/0.25 μm, Helium, 6. K/min; Tstart: 60. C; Tend: 220. C
CapillarySE-301228.Loizzo, Tundis, et al., 200730. m/0.25 mm/0.25 μm, He, 40. C @ 5. min, 5. K/min, 250. C @ 10. min
CapillaryHP-51214.Loizzo, Tundis, et al., 200730. m/0.25 mm/0.25 μm, He, 40. C @ 5. min, 5. K/min, 250. C @ 10. min
CapillaryDB-51231.Sylvestre, Pichette, et al., 200730. m/0.25 mm/0.25 μm, 2. K/min, 250. C @ 33. min; Tstart: 40. C
CapillaryHP-5MS1227.Vichi, Riu-Aumatell, et al., 200730. m/0.25 mm/0.25 μm, He, 40. C @ 5. min, 3. K/min, 250. C @ 10. min
CapillaryHP-51237.Wenguang, Wenlai, et al., 200730. m/0.25 mm/0.25 μm, 40. C @ 3. min, 5. K/min, 240. C @ 10. min
CapillaryBP-11208.Boti, Yao, et al., 200650. m/0.22 mm/0.25 μm, 2. K/min, 220. C @ 20. min; Tstart: 60. C
CapillarySPB-11210.Cavaleiro, Pinto, et al., 200630. m/0.20 mm/0.20 μm, Helium, 3. K/min, 220. C @ 15. min; Tstart: 70. C
CapillaryBP-11208.Fanciullino, Tomi, et al., 200650. m/0.22 mm/0.25 μm, He, 2. K/min, 220. C @ 20. min; Tstart: 60. C
CapillaryFSOT-RSL-2001226.Jirovetz, Eller, et al., 200630. m/0.32 mm/0.25 μm, Hydrogen, 40. C @ 5. min, 6. K/min, 280. C @ 5. min
CapillaryDB-11207.Lan Phi N.T., Nishiyama C., et al., 200660. m/0.25 mm/0.25 μm, 70. C @ 2. min, 2. K/min, 230. C @ 20. min
CapillaryCP Sil 5 CB1210.Lis and Milczarek, 200630. m/0.32 mm/0.25 μm, N2, 4. K/min; Tstart: 50. C; Tend: 300. C
CapillaryNB-301222.Orav, Raal, et al., 200630. m/0.2 mm/0.25 μm, He, 2. K/min; Tstart: 50. C; Tend: 250. C
CapillaryDB-51235.Ouamba, Ouabonzi, et al., 200625. m/0.25 mm/0.15 μm, N2, 50. C @ 3. min, 4. K/min; Tend: 200. C
CapillaryDB-51233.Ozel, Gogus, et al., 200630. m/0.32 mm/0.25 μm, He, 60. C @ 0.5 min, 5. K/min, 280. C @ 2. min
CapillaryPE-51230.Pandey-Rai S., Mallavarapu G.R., et al., 200650. m/0.32 mm/0.25 μm, He, 100. C @ 1. min, 3. K/min; Tend: 280. C
CapillaryHP-5MS1228.Robinson, 200630. m/0.25 mm/0.25 μm, 50. C @ 5. min, 10. K/min; Tend: 250. C
CapillaryHP-5MS1227.Setzer, Noletto, et al., 200630. m/0.25 mm/0.25 μm, He, 60. C @ 5. min, 3. K/min; Tend: 280. C
CapillaryHP-51233.Wang, Yang, et al., 200630. m/0.25 mm/0.25 μm, He, 60. C @ 2. min, 10. K/min, 250. C @ 10. min
CapillaryBPX-51241.Wohlmuth, Smith, et al., 200650. m/0.22 mm/1. μm, 4. K/min, 280. C @ 4. min; Tstart: 70. C
CapillaryDB-51229.Chagonda and Chalchat, 200550. m/0.3 mm/0.25 μm, 2. K/min; Tstart: 60. C; Tend: 240. C
CapillaryMethyl Silicone1223.Chalchat and Özcan, 2005He, 3. K/min; Column length: 60. m; Column diameter: 0.3 mm; Tstart: 50. C; Tend: 240. C
CapillaryHP-51230.Duarte, Figueira, et al., 200525. m/0.2 mm/0.33 μm, He, 3. K/min, 240. C @ 7. min; Tstart: 60. C
CapillaryHP-5MS1237.Ghasemi Y., Faridi P., et al., 2005He, 50. C @ 3. min, 3. K/min, 250. C @ 10. min; Column length: 25. m; Column diameter: 0.25 mm
CapillaryRSL-2001211.Jirovetz, Buchbauer, et al., 200530. m/0.25 mm/0.25 μm, 40. C @ 2. min, 6. K/min, 280. C @ 10. min
CapillaryRTX-5 MS1234.Pellati, Benvenuti, et al., 200530. m/0.25 mm/0.25 μm, He, 50. C @ 2. min, 8. K/min, 280. C @ 2. min
CapillaryHP-5MS1230.Setzer, Noletto, et al., 200530. m/0.25 mm/0.25 μm, He, 60. C @ 5. min, 3. K/min; Tend: 280. C
CapillaryHP-5MS1228.Shams-Ardakani, Ghannadi, et al., 200530. m/0.25 mm/0.25 μm, He, 15. K/min; Tstart: 60. C; Tend: 275. C
CapillaryPE-51233.Singh, Raina, et al., 200530. m/0.32 mm/0.25 μm, H2, 60. C @ 2. min, 5. K/min, 230. C @ 4. min
CapillaryHP-5MS1259.Tepe B., Sokmen M., et al., 200530. m/0.25 mm/0.25 μm, He, 50. C @ 3. min, 3. K/min; Tend: 240. C
CapillaryHP-5MS1228.Tesevic, Nikicevic, et al., 200530. m/0.25 mm/0.25 μm, He, 4.3 K/min; Tstart: 60. C; Tend: 285. C
CapillaryHP-5MS1227.Vichi, Riu-Aumatell, et al., 200530. m/0.25 mm/0.25 μm, 40. C @ 5. min, 3. K/min, 220. C @ 10. min
CapillaryDB-51212.Agnihotri, Thappa, et al., 200430. m/0.25 mm/0.25 μm, He, 90. C @ 2. min, 7. K/min, 220. C @ 5. min
CapillaryDB-11221.Choi, 200460. m/0.25 mm/0.25 μm, N2, 70. C @ 2. min, 2. K/min, 230. C @ 20. min
CapillaryRTX-11211.Lis, Boczek, et al., 200430. m/0.32 mm/0.25 μm, N2, 4. K/min; Tstart: 60. C; Tend: 300. C
CapillaryHP-5MS1228.Mimica-Dukic, Bozin, et al., 200430. m/0.25 mm/0.25 μm, He, 3. K/min; Tstart: 60. C; Tend: 280. C
CapillaryDB-11213.Palá-Paúl, García-Jiménez, et al., 200450. m/0.22 mm/0.25 μm, He, 4. K/min; Tstart: 70. C; Tend: 220. C
CapillaryNB-301222.Raal, Arak, et al., 200450. m/0.2 mm/0.25 μm, He, 2. K/min; Tstart: 50. C; Tend: 250. C
CapillaryDB-11220.Sawamura, Son, et al., 200460. m/0.25 mm/0.25 μm, 70. C @ 2. min, 2. K/min, 230. C @ 20. min
CapillaryDB-11220.Sawamura, Sou, et al., 200460. m/0.25 mm/0.25 μm, Nitrogen, 70. C @ 2. min, 2. K/min; Tend: 230. C
CapillaryDB-11220.Choi, 2003, 260. m/0.25 mm/0.25 μm, He, 70. C @ 2. min, 2. K/min, 230. C @ 20. min
CapillaryRSL-2001211.Jirovetz, Buchbauer, et al., 200330. m/0.25 mm/0.25 μm, H2, 40. C @ 2. min, 6. K/min, 280. C @ 10. min
CapillaryHP-51229.Mookdasanit, Tamura, et al., 2003Helium, 2. K/min, 210. C @ 60. min; Column length: 30. m; Column diameter: 0.32 mm; Tstart: 70. C
CapillaryMPS-51224.Nakahara, Alzoreky, et al., 200370. C @ 2. min, 5. K/min; Tend: 180. C
CapillaryDB-11214.Cimanga, Apers, et al., 200260. m/0.32 mm/0.25 μm, He, 50. C @ 6. min, 3. K/min; Tend: 200. C
CapillaryDB-11208.Gancel, Ollé, et al., 200230. m/0.32 mm/0.25 μm, H2, 40. C @ 20. min, 3. K/min; Tend: 245. C
CapillaryHP-51226.Ghannadi, Sajjadi, et al., 200230. m/0.25 mm/0.25 μm, He, 4. K/min; Tstart: 60. C; Tend: 275. C
CapillaryRSL-2001228.Jirovetz, Buchbauer, et al., 200230. m/0.32 mm/0.25 μm, H2, 40. C @ 5. min, 6. K/min, 280. C @ 5. min
CapillaryRSL-2001215.Jirovetz, Ngassoum, et al., 200230. m/0.32 mm/0.25 μm, H2, 50. C @ 5. min, 6. K/min, 280. C @ 5. min
CapillaryRSL-2001211.Jirovetz, Smith, et al., 200230. m/0.25 mm/0.25 μm, H2, 40. C @ 2. min, 6. K/min, 280. C @ 10. min
CapillaryHP-51223.Lockwood, Asghari, et al., 200230. m/0.25 mm/0.25 μm, 60. C @ 4. min, 4. K/min; Tend: 275. C
CapillaryBP-51234.Doimo, 200150. m/0.25 mm/1. μm, H2, 6. K/min; Tstart: 60. C; Tend: 270. C
CapillaryBP-11215.Gupta, Mallavarapu, et al., 200130. m/0.25 mm/0.25 μm, N2, 5. K/min; Tstart: 60. C; Tend: 220. C
CapillarySPB-11212.Kamath, Asha, et al., 200130. m/0.25 mm/0.25 μm, N2, 70. C @ 2. min, 2. K/min, 180. C @ 1. min
CapillaryBP-11207.Lota, de Rocca Serra, et al., 200150. m/0.22 mm/0.25 μm, He, 2. K/min, 230. C @ 35. min; Tstart: 60. C
CapillaryOV-1011209.Yang, 2001N2, 2. K/min; Column length: 50. m; Column diameter: 0.25 mm; Tstart: 80. C; Tend: 200. C
CapillarySPB-51232.Kim, Kim, et al., 200060. m/0.25 mm/0.25 μm, He, 70. C @ 8. min, 5. K/min, 240. C @ 20. min
CapillaryDB-51226.Mitiku, Sawamura, et al., 200030. m/0.22 mm/0.25 μm, N2, 70. C @ 2. min, 4. K/min, 230. C @ 20. min
CapillaryOV-11202.Oberhofer, Nikiforov, et al., 199925. m/0.25 mm/0.25 μm, H2, 40. C @ 5. min, 3. K/min, 220. C @ 5. min
CapillaryHP-11212.Ong and Acree, 19994. K/min; Column length: 25. m; Column diameter: 0.20 mm; Tstart: 35. C; Tend: 250. C
CapillaryOV-1011225.Tropnikova, Zenkevich, et al., 1999Nitrogen, 60. C @ 0. min, 4. K/min, 220. C @ 0. min; Column length: 25. m; Column diameter: 0.20 mm
CapillaryDB-51228.Zoghbi, Andrade, et al., 199930. m/0.25 mm/0.25 μm, He, 3. K/min; Tstart: 60. C; Tend: 240. C
CapillaryBP-51231.Ferreira, Ardanuy, et al., 199850. m/0.32 mm/1. μm, He, 40. C @ 5. min, 2. K/min; Tend: 190. C
CapillaryHP-11212.Ong and Acree, 19984. K/min; Column length: 25. m; Column diameter: 0.32 mm; Tstart: 35. C; Tend: 250. C
CapillaryBP-11209.Rajeswara, Kaul, et al., 1996N2, 5. K/min; Column length: 25. m; Column diameter: 0.50 mm; Tstart: 60. C; Tend: 220. C
CapillaryBP-11212.Rajeswara, Kaul, et al., 1996N2, 5. K/min; Column length: 25. m; Column diameter: 0.50 mm; Tstart: 60. C; Tend: 220. C
CapillaryBP-11213.Rajeswara, Kaul, et al., 1996N2, 5. K/min; Column length: 25. m; Column diameter: 0.50 mm; Tstart: 60. C; Tend: 220. C
CapillaryDB-51231.Sohounhloue, Dangou, et al., 199640. C @ 2. min, 2. K/min, 210. C @ 33. min; Column length: 30. m; Column diameter: 0.25 mm
CapillaryDB-11203.Tirado, Stashenko, et al., 199560. m/0.25 mm/0.25 μm, He, 70. C @ 5. min, 2.5 K/min; Tend: 270. C
CapillaryDB-11203.Tirado, Stashenko, et al., 199560. m/0.25 mm/0.25 μm, He, 70. C @ 5. min, 2.5 K/min; Tend: 270. C
CapillaryOV-1011209.Tamura, Yang, et al., 19932. K/min; Column length: 50. m; Column diameter: 0.25 mm; Tstart: 80. C; Tend: 200. C
CapillaryOV-1011209.Tamura, Yang, et al., 19932. K/min; Column length: 50. m; Column diameter: 0.25 mm; Tstart: 80. C; Tend: 200. C
CapillaryDB-11211.Shiota, 199160. m/0.25 mm/0.25 μm, He, 3. K/min; Tstart: 50. C; Tend: 240. C
CapillaryDB-11211.Shiota, 199160. m/0.25 mm/0.25 μm, He, 3. K/min; Tstart: 50. C; Tend: 240. C
CapillaryDB-11204.Velasco-Negueruela, Pérez Alonso, et al., 1991N2, 4. K/min; Column length: 30. m; Tstart: 80. C; Tend: 220. C
CapillaryOV-1011209.Yang and Sugisawa, 1990N2, 2. K/min; Column length: 50. m; Column diameter: 0.25 mm; Tstart: 80. C; Tend: 200. C
CapillaryOV-1011210.Yang and Sugisawa, 1990N2, 2. K/min; Column length: 50. m; Column diameter: 0.25 mm; Tstart: 80. C; Tend: 200. C
CapillaryOV-1011209.Sugisawa, Yamamoto, et al., 1989N2, 2. K/min; Column length: 50. m; Column diameter: 0.25 mm; Tstart: 80. C; Tend: 200. C
CapillaryOV-1011207.Sugisawa, Yang, et al., 1989N2, 2. K/min; Column length: 50. m; Column diameter: 0.25 mm; Tstart: 80. C; Tend: 200. C
CapillaryOV-1011209.Sugisawa, Yang, et al., 1989N2, 2. K/min; Column length: 50. m; Column diameter: 0.25 mm; Tstart: 80. C; Tend: 200. C
CapillarySE-30+Igepal1218.Shibamoto and Jennings, 19771. K/min; Column length: 100. m; Column diameter: 0.25 mm; Tstart: 70. C; Tend: 170. C

Normal alkane RI, non-polar column, custom temperature program

View large format table.

Column type Active phase I Reference Comment
CapillaryRTX-5 MS1228.Pinheiro, de Queiros, et al., 2013Helium; Column length: 30. m; Column diameter: 0.25 mm; Program: not specified
CapillaryRTX-11211.Bendiabdellah, El Amine Dib, et al., 201260. m/0.22 mm/0.25 μm, Helium; Program: not specified
CapillaryRTX-11211.Bendiabdellah, El Amine Dib, et al., 201260. m/0.22 mm/0.25 μm, Helium; Program: not specified
CapillaryCP-Sil 5 CB1226.Collin, Nizet, et al., 201250. m/0.32 mm/1.20 μm, Nitrogen; Program: 36 0C 20 0C/min -> 85 0C 1 0C/min -> 145 0C 3 0C/min -> 250 0C (30 min)
CapillaryPolydimethyl siloxane with 5 % Ph groups1233.Robinson, Adams, et al., 2012Program: not specified
CapillaryPolydimethyl siloxane with 5 % Ph groups1233.Robinson, Adams, et al., 2012Program: not specified
CapillarySiloxane, 5 % Ph1226.VOC BinBase, 2012Program: not specified
CapillaryCP-Sil 5 CB1212.Gros, Nizet, et al., 201150. m/0.32 mm/1.20 μm, Nitrogen; Program: 36 0C 20 0C/min -> 85 0C 1 0C/min -> 145 0C 3 0C/min -> 250 0C (30 min)
CapillaryHP-51229.Laribi, Kouki, et al., 201130. m/0.25 mm/0.25 μm, Nitrogen; Program: 35 0C (10 min) 3 0C/min -> 205 0C 10 0C/min -> 225 0C
CapillaryDB-51236.Miyazaki, Plotto, et al., 201160. m/0.25 mm/1.00 μm, Helium; Program: 40 0C 4 0C/min -> 230 0C 100 0C/min -> 260 0C (11.7 min)
CapillaryPolydimethyl siloxane, 5 % phenyl1226.Skogerson, Wohlgemuth, et al., 2011Program: not specified
CapillaryHP-5 MS1213.Liu, Chu, et al., 201030. m/0.25 mm/0.25 μm, Helium; Program: 60 0C (1 min) 10 0C/min -> 180 0C (1 min) 20 0C/min -> 280 0C (15 min)
CapillaryDB-51231.San-Juan, Petka, et al., 201030. m/0.32 mm/0.50 μm, Hydrogen; Program: 40 0C (5 min) 4 0C/min -> 100 0C 6 0C/min -> 220 0C (20 min)
CapillarySLB-5 MS1232.Scandinaro, Tranchida, et al., 201010. m/0.10 mm/0.10 μm, Helium; Program: not specified
CapillaryHP-51230.Custer, 200925. m/0.32 mm/0.17 μm, Helium; Program: 60 0C (5 min) 4 0C/min -> 220 0C 11 0C/min -> 280 0C (15 min)
CapillaryHP-51225.Custer, 200925. m/0.32 mm/0.17 μm, Helium; Program: not specified
CapillaryDB-11212.Delort and Jaquier, 200960. m/0.25 mm/0.25 μm, Helium; Program: 50 0C (5 min) 3 0C/min -> 120 0C 5 0C/min -> 250 0C (3 min) 15 0C/min -> 300 0C (20 min)
CapillaryHP-5 MS1236.Dharmawan, Kasapis, et al., 200960. m/0.32 mm/1.0 μm, Helium; Program: 120 0C 2 0C/min -> 240 0C 10 0C/min -> 270 0C (2 min)
CapillaryDB-11210.Mendes, Trindade, et al., 200930. m/0.25 mm/0.25 μm, Hydrogen; Program: 45 0C 3 0C/min -> 175 0C 15 0C/min -> 300 0C (10 min)
CapillaryHP-51229.Riahi, Pourbasheer, et al., 2009Column length: 30. m; Column diameter: 0.32 mm; Program: not specified
CapillaryDB-51231.Yang, Yang, et al., 200930. m/0.25 mm/0.25 μm, Helium; Program: 50 0C 95 min) 3 0C/min -> 100 0C 4 0C/min -> 160 0C 5 0C/min -> 220 0C (15 min)
CapillarySLB-5 MS1232.Lo Presti, Sciarrone, et al., 200830. m/0.25 mm/0.25 μm, Helium; Program: not specified
CapillaryRTX-51226.Zachariah, Leela, et al., 200830. m/0.25 mm/0.25 μm, Helium; Program: 60 0C (5 min) 5 0C/min -> 110 0C 3 0C/min -> 220 0C (5 min)
CapillaryRTX-51226.Zachariah, Leela, et al., 200830. m/0.25 mm/0.25 μm, Helium; Program: not specified
CapillaryDB-11208.Ferreira, Meireles de Sousa, et al., 200730. m/0.25 mm/0.25 μm, He; Program: 45C => 3C/min => 175C => 15C/min => 300C (10min)
CapillaryDB-11210.Kamatou, Viljoen, et al., 200730. m/0.25 mm/0.25 μm, H2; Program: 45 0C 3 0C/min -> 175 0C 15 0C/min -> 300 0C (10 min)
CapillaryDB-51226.Nivinsliene, Butkiene, et al., 200750. m/0.32 mm/0.25 μm, Helium; Program: 60 0C (1 min) 5 0C/min -> 160 0C 10 0C/min -> 250 0C
CapillaryCP Sil 8 CB1226.Radusiene, Judzentiene, et al., 200750. m/0.32 mm/0.25 μm, Helium; Program: 60 0C (2 min) 5 0C/min -> 160 0C (1 min) 10 0C/min -> 280 0C (3 min)
CapillaryHP-51260.Jordan, Martinez, et al., 200630. m/0.25 mm/0.25 μm, He; Program: 60C(4min) => 1C/min => 64C => 2.5C/min => 155C => 5C/min => 250C
CapillaryHP-5 MS1227.Schmidt, Noletto, et al., 200630. m/0.25 mm/0.25 μm, Helium; Program: 40 0C (10 min) 3 0C/min -> 200 0C 2 0C/min -> 220 0C
CapillaryHP-5MS1230.Singh G., Maurya S., et al., 200630. m/0.32 mm/0.25 μm, He; Program: 60C(1min) => 1.5C => 185C => 9C/min => 275C (2min)
CapillaryDB-51230.Srivastava, Mallavarapu, et al., 200630. m/0.32 mm/0.25 μm, He; Program: 60C => 2C/min => 100C => 3C/min => 160C => 5C/min => 280C
CapillarySE-521226.Tognolini, Barocelli, et al., 200630. m/0.32 mm/0.15 μm, He; Program: 45C => 1C/min => 100C => 5C/min => 250C (10min)
CapillaryCP Sil 8 CB1226.Butkienë, Nivinskienë, et al., 200550. m/0.32 mm/0.25 μm, He; Program: 50C(5min) => 2C/min => 90C => 15C/min => 240C(4min)
CapillaryHP-51230.Singh, Maurya, et al., 2005Column length: 30. m; Column diameter: 0.32 mm; Program: 65C(1min) => 1C/min => 75C (2min) => 0.5C/min => 81C(2min) => 3C/min => 180C(7min)
CapillaryCP Sil 8 CB1226.Butkienë, Nivinskienë, et al., 200450. m/0.32 mm/0.25 μm, He; Program: 50C(5min) => 2C/min => 90C => 15C/min => 240C(4min)
CapillaryHP-11228.Carpino, Mallia, et al., 200412. m/0.32 mm/0.52 μm; Program: 35C(3min) => 6C/min => 190C => 30C/min => 225C
CapillaryHP-11228.Carpino, Mallia, et al., 2004, 225. m/0.2 mm/0.11 μm; Program: 35C(3min) => 4C/min => 190C => 30C/min => 225C(3min)
CapillaryBPX-51226.Koba, Sanda, et al., 200430. m/0.25 mm/0.25 μm, H2; Program: 50 0C (1 min) 3 0C/min -> 150 0C 5 0C/min -> 250 0C (5 min)
CapillaryHP-51260.Sotomayor, Martínez, et al., 200430. m/0.25 mm/0.25 μm, He; Program: 60C(4min) => 1C/min => 64C => 2.5C/min => 155C => 5C/min => 250C
CapillarySE-301211.Vinogradov, 2004Program: not specified
CapillarySE-301215.Vinogradov, 2004Program: not specified
CapillaryHP-51260.Jordán, Martínez, et al., 200330. m/0.25 mm/0.25 μm, He; Program: 60C (4min) => 1C/min => 64C => 2.5C/min => 155C => 5C/min => 250C
CapillaryHP-51228.Jordán, Goodner, et al., 200230. m/0.25 mm/0.25 μm; Program: not specified
CapillaryHP-11210.Betts, 200012. m/0.20 mm/0.33 μm, He; Program: 40 0C 6.7 0C/min -> 87 0C (9 min) 10 0C/min -> 187 0C
CapillaryDB-11208.da Silva, Figueiredo, et al., 199830. m/0.25 mm/0.25 μm, H2; Program: 45C => 3C/min => 175C => 15C => 240C(10min)
CapillaryDB-51226.Anitescu, Doneanu, et al., 199715. m/0.25 mm/0.25 μm, He; Program: 40C(5min) => 5C/min => 120C(10min) => 4C/min => 250C(4min) => 5C/min => 280C
CapillaryDB-11208.Gaspar, Palma, et al., 199730. m/0.25 mm/0.25 μm, He; Program: 45C => 3C/min => 175C => 15C/min => 280C
CapillaryDB-51227.Guth, 199730. m/0.32 mm/0.25 μm; Program: 35C (1min) => 40C/min => 60C (1min) => 6C/min => 250C (10min)
CapillaryPolydimethyl siloxanes1216.Zenkevich, 1997Program: not specified
CapillaryDB-51231.Garneau, Bouhajib, et al., 1994Column length: 30. m; Column diameter: 0.25 mm; Program: not specified
CapillaryOV-1011215.Shibamoto, 1987Program: not specified
CapillaryOV-1, SE-30, Methyl silicone, SP-2100, OV-101, DB-1, etc.1225.Waggott and Davies, 1984Hydrogen; Column length: 50. m; Column diameter: 0.32 mm; Program: not specified
PackedOV-1011216.Swigar and Silverstein, 1981N2, Chromosorb G 60-80mesh DMCS; Column length: 2.5 m; Program: not specified

Normal alkane RI, polar column, temperature ramp

View large format table.

Column type Active phase I Reference Comment
CapillaryRTX-Wax1724.Bendiabdellah, El Amine Dib, et al., 201260. m/0.22 mm/0.25 μm, Helium, 2. K/min, 230. C @ 5. min; Tstart: 60. C
CapillaryVF-Wax MS1760.Duarte, Dias, et al., 201060. m/0.25 mm/0.25 μm, Helium, 60. C @ 5. min, 3. K/min, 220. C @ 25. min
CapillaryBP-201740.Mishra, Chaudhary, et al., 2010Nitrogen, 5. K/min; Tstart: 60. C; Tend: 200. C
CapillaryTC-Wax1763.Miyazawa, Fujita, et al., 2010Helium, 40. C @ 3. min, 3. K/min; Column length: 60. m; Column diameter: 0.25 mm; Tend: 230. C
CapillaryInnowax1777.Seo, Kim, et al., 200930. m/0.25 mm/0.25 μm, Helium, 40. C @ 1. min, 6. K/min, 250. C @ 4. min
CapillaryDB-Wax1764.Zhao, Xu, et al., 200930. m/0.25 mm/0.25 μm, Helium, 40. C @ 2. min, 3. K/min, 230. C @ 5. min
CapillaryHP-Innowax1766.Soria, Sanz, et al., 200850. m/0.20 mm/0.20 μm, Helium, 45. C @ 2. min, 4. K/min, 190. C @ 50. min
CapillaryHP-Innowax1764.Cheraif, Ben Jannet, et al., 200730. m/0.25 mm/0.25 μm, N2, 50. C @ 1. min, 5. K/min, 240. C @ 4. min
CapillaryCarbowax1749.Ferhat, Tigrine-Kordjani, et al., 200760. m/0.2 mm/0.25 μm, He, 60. C @ 8. min, 2. K/min, 250. C @ 15. min
CapillaryCarbowax1718.Singh, Kumar, et al., 200760. m/0.25 mm/0.25 μm, He, 5. K/min; Tstart: 40. C; Tend: 180. C
CapillarySupelcowax-101778.Sylvestre, Pichette, et al., 200730. m/0.25 mm/0.25 μm, 2. K/min, 250. C @ 33. min; Tstart: 40. C
CapillarySupelcowax-101780.Vichi, Riu-Aumatell, et al., 200730. m/0.25 mm/0.25 μm, He, 40. C @ 5. min, 3. K/min, 250. C @ 10. min
CapillaryDB-Wax1773.Wei A. and Shibamoto T., 200760. m/0.25 mm/0.25 μm, He, 60. C @ 8. min, 3. K/min, 180. C @ 80. min
CapillaryBP-201763.Boti, Yao, et al., 200650. m/0.22 mm/0.25 μm, 2. K/min, 220. C @ 20. min; Tstart: 60. C
CapillarySupelcowax 101764.Cavaleiro, Pinto, et al., 200630. m/0.20 mm/0.20 μm, Helium, 3. K/min, 220. C @ 15. min; Tstart: 70. C
CapillaryDB-Wax1774.Choi H.S., 200660. m/0.25 mm/0.25 μm, He, 70. C @ 2. min, 2. K/min, 230. C @ 20. min
CapillaryBP-201764.Fanciullino, Tomi, et al., 200650. m/0.22 mm/0.25 μm, He, 2. K/min, 220. C @ 20. min; Tstart: 60. C
CapillaryDB-Wax Etr1775.Ibarz, Ferreira, et al., 200660. m/0.25 mm/0.25 μm, He, 40. C @ 5. min, 2. K/min, 230. C @ 100. min
CapillaryDB-Wax1764.Lan Phi N.T., Nishiyama C., et al., 200660. m/0.25 mm/0.25 μm, 70. C @ 2. min, 2. K/min, 230. C @ 20. min
CapillaryDB-Wax1763.Lan Phi N.T., Nishiyama C., et al., 200660. m/0.25 mm/0.25 μm, 70. C @ 2. min, 2. K/min, 230. C @ 20. min
CapillaryNB-20M1800.Orav, Raal, et al., 200630. m/0.2 mm/0.25 μm, He, 2. K/min; Tstart: 50. C; Tend: 250. C
CapillaryCarbowax 20M1722.Babu and Kaul, 200560. m/0.25 mm/0.25 μm, N2, 40. C @ 2. min, 10. K/min, 190. C @ 15. min
CapillaryStabilwax1777.Jirovetz, Buchbauer, et al., 2005, 230. m/0.32 mm/0.5 μm, H2, 40. C @ 5. min, 6. K/min, 280. C @ 5. min
CapillaryStabilwax1777.Jirovetz, Buchbauer, et al., 2005, 330. m/0.32 mm/0.5 μm, 40. C @ 5. min, 6. K/min, 280. C @ 5. min
CapillaryInnowax1763.Joichi, Yomogida, et al., 200560. m/0.25 mm/0.25 μm, He, 5. K/min, 240. C @ 30. min; Tstart: 60. C
CapillaryDB-Wax1761.Lee, Umano, et al., 200530. m/0.25 mm/0.25 μm, He, 3. K/min, 180. C @ 40. min; Tstart: 50. C
CapillaryDB-Wax1775.Njoroge, Koaze, et al., 200560. m/0.25 mm/0.25 μm, N2, 70. C @ 2. min, 2. K/min, 230. C @ 20. min
CapillaryDB-Wax1791.Qian and Wang, 200560. m/0.32 mm/0.50 μm, Nitrogen, 35. C @ 4. min, 2. K/min, 235. C @ 30. min
CapillaryPE-Wax1779.Ram, Kumar, et al., 200550. m/0.32 mm/0.25 μm, H2, 4. K/min, 220. C @ 2. min; Tstart: 60. C
CapillarySupelcowax-101780.Vichi, Riu-Aumatell, et al., 200530. m/0.25 mm/0.25 μm, 40. C @ 5. min, 3. K/min, 220. C @ 10. min
CapillaryDB-Wax1803.Agnihotri, Thappa, et al., 200430. m/0.25 mm/0.25 μm, He, 90. C @ 2. min, 7. K/min, 220. C @ 5. min
CapillaryDB-Wax1772.Choi, 200460. m/0.25 mm/0.25 μm, N2, 70. C @ 2. min, 2. K/min, 230. C @ 20. min
CapillaryDB-Wax1774.Choi, 2004, 260. m/0.25 mm/0.25 μm, N2, 70. C @ 2. min, 2. K/min, 230. C @ 20. min
CapillaryDB-Wax1765.Jiang and Kubota, 2004He, 60. C @ 4. min, 2. K/min; Column length: 60. m; Column diameter: 0.25 mm; Tend: 220. C
CapillaryDB-Wax1765.Jiang and Kubota, 2004He, 60. C @ 4. min, 2. K/min; Column length: 60. m; Column diameter: 0.25 mm; Tend: 220. C
CapillaryNB-20M1800.Raal, Arak, et al., 200450. m/0.2 mm/0.25 μm, He, 2. K/min; Tstart: 50. C; Tend: 250. C
CapillaryDB-Wax1775.Sawamura, Son, et al., 200460. m/0.25 mm/0.25 μm, 70. C @ 2. min, 2. K/min, 230. C @ 20. min
CapillaryDB-Wax1775.Sawamura, Sou, et al., 200460. m/0.25 mm/0.25 μm, Nitrogen, 70. C @ 2. min, 2. K/min; Tend: 230. C
CapillaryDB-Wax1766.Mookdasanit, Tamura, et al., 2003Helium, 2. K/min, 210. C @ 60. min; Column length: 60. m; Column diameter: 0.25 mm; Tstart: 70. C
CapillaryPEG 20M1755.Nakahara, Alzoreky, et al., 200370. C @ 2. min, 5. K/min; Tend: 180. C
CapillaryDB-Wax1745.Tu, Onishi, et al., 200360. m/0.25 mm/0.25 μm, N2, 70. C @ 2. min, 2. K/min, 230. C @ 20. min
CapillaryDB-Wax1752.Tu, Onishi, et al., 2003, 260. m/0.25 mm/0.25 μm, N2, 70. C @ 2. min, 2. K/min, 230. C @ 20. min
CapillaryDB-Wax1764.Gancel, Ollé, et al., 200260. m/0.32 mm/0.25 μm, H2, 1.5 K/min, 245. C @ 20. min; Tstart: 40. C
CapillaryDB-Wax1757.Tu, Onishi, et al., 200260. m/0.25 mm/0.25 μm, N2, 70. C @ 2. min, 2. K/min, 230. C @ 20. min
CapillaryDB-Wax1771.Tu, Thanh, et al., 200260. m/0.25 mm/0.25 μm, N2, 2. K/min; Tstart: 70. C; Tend: 230. C
CapillaryDB-Wax1759.Umano, Hagi, et al., 200260. m/0.25 mm/0.25 μm, He, 40. C @ 2. min, 2. K/min; Tend: 200. C
CapillaryDB-Wax1766.Christoph, 200160. m/0.25 mm/0.25 μm, He, 3. K/min; Tstart: 45. C; Tend: 240. C
CapillaryDB-Wax1786.Ferreira, Aznar, et al., 200130. m/0.32 mm/0.5 μm, H2, 40. C @ 5. min, 4. K/min, 200. C @ 60. min
CapillaryDB-Wax1789.Jiang, Kojima, et al., 2001He, 60. C @ 4. min, 2. K/min; Column length: 60. m; Column diameter: 0.25 mm; Tend: 220. C
CapillaryDB-Wax1782.Jiang and Kubota, 2001He, 2. K/min; Column length: 60. m; Column diameter: 0.25 mm; Tstart: 40. C; Tend: 220. C
CapillaryBP-201756.Lota, de Rocca Serra, et al., 200150. m/0.22 mm/0.25 μm, He, 2. K/min, 230. C @ 35. min; Tstart: 60. C
CapillarySupelcowax-101755.Kim, Kim, et al., 200030. m/0.32 mm/0.25 μm, He, 70. C @ 8. min, 5. K/min, 240. C @ 20. min
CapillarySupelcowax-101740.Korány, Mednyánszky, et al., 200060. m/0.25 mm/0.25 μm, He, 4. K/min; Tstart: 60. C; Tend: 280. C
CapillaryDB-Wax1769.Umano, Hagi, et al., 200060. m/0.25 mm/0.25 μm, He, 40. C @ 2. min, 2. K/min; Tend: 200. C
CapillarySupelcowax-101752.Choo, Wong, et al., 199930. m/0.25 mm/0.25 μm, 4. K/min; Tstart: 60. C; Tend: 220. C
CapillaryHP-Innowax1764.Ong and Acree, 19994. K/min; Column length: 25. m; Column diameter: 0.25 mm; Tstart: 35. C; Tend: 250. C
CapillaryDB-Wax1768.Umano, Nakahara, et al., 199960. m/0.25 mm/0.25 μm, He, 40. C @ 2. min, 2. K/min; Tend: 200. C
CapillaryCP-Wax 52CB1771.Chisowa, Hall, et al., 199825. m/0.32 mm/0.2 μm, He, 60. C @ 2. min, 6. K/min, 240. C @ 10. min
CapillaryCarbowax 20M1773.Ferreira, Ardanuy, et al., 199860. m/0.32 mm/0.5 μm, He, 40. C @ 5. min, 2. K/min; Tend: 190. C
CapillaryDB-Wax1778.Mölleken, Sinnwell, et al., 199830. m/0.25 mm/0.25 μm, N2, 3. K/min; Tstart: 45. C; Tend: 220. C
CapillaryHP-Innowax1764.Ong and Acree, 19984. K/min; Column length: 25. m; Column diameter: 0.32 mm; Tstart: 35. C; Tend: 250. C
CapillaryDB-Wax1760.Werkhoff, Güntert, et al., 199860. m/0.32 mm/0.25 μm, H2, 3. K/min; Tstart: 60. C; Tend: 220. C
CapillaryPEG-20M1763.Awano, Honda, et al., 1997He, 3. K/min; Column length: 60. m; Column diameter: 0.25 mm; Tstart: 70. C; Tend: 210. C
CapillaryPEG-20M1764.Orav, Kailas, et al., 1996He, 2. K/min; Column length: 50. m; Column diameter: 0.25 mm; Tstart: 70. C; Tend: 250. C
CapillarySupelcowax-101768.Wong and Lai, 199660. m/0.25 mm/0.25 μm, He, 40. C @ 3. min, 3. K/min, 200. C @ 30. min
CapillaryCarbowax 20M1751.Tirado, Stashenko, et al., 199560. m/0.25 mm/0.25 μm, He, 50. C @ 10. min, 2. K/min, 150. C @ 20. min
CapillaryCarbowax 20M1744.Shibamoto and Jennings, 19771. K/min; Column length: 100. m; Column diameter: 0.25 mm; Tstart: 70. C; Tend: 170. C
CapillaryCarbowax 20M1745.Shibamoto and Jennings, 19771. K/min; Column length: 100. m; Column diameter: 0.25 mm; Tstart: 70. C; Tend: 170. C
PackedCarbowax 20M1741.Stancher and Pertoldi, 1967Hydrogen, Gas-Chrom Z (80-100 mesh), 4. K/min; Column length: 2. m; Tstart: 65. C; Tend: 220. C
PackedCarbowax 20M1741.Stancher and Pertoldi, 1967Hydrogen, Gas-Chrom Z (80-100 mesh), 4. K/min; Column length: 2. m; Tstart: 65. C; Tend: 220. C

Normal alkane RI, polar column, custom temperature program

View large format table.

Column type Active phase I Reference Comment
CapillaryCarbowax 20M1767.Lee, Chong, et al., 2012Program: not specified
CapillarySupelco CO Wax-101767.Prompona, Kandylis, et al., 201260. m/0.32 mm/0.25 μm, Helium; Program: 35 0C (6 min) 2 0C/min -> 60 0C (5 min) 5 0C/min -> 200 0C 25 0C/min -> 250 0C (6 min)
CapillarySupelco CO Wax-101790.Prompona, Kandylis, et al., 201260. m/0.32 mm/0.25 μm, Helium; Program: not specified
CapillaryHP Innowax1766.Laribi, Kouki, et al., 201130. m/0.25 mm/0.25 μm, Nitrogen; Program: 35 0C (10 min) 3 0C/min -> 205 0C 10 0C/min -> 225 0C
CapillaryDB-Wax1780.San-Juan, Petka, et al., 201030. m/0.32 mm/0.50 μm, Hydrogen; Program: 40 0C (5 min) 4 0C/min -> 100 0C 6 0C/min -> 220 0C (20 min)
CapillaryDB-Wax1811.Canuti, Conversano, et al., 200930. m/0.25 mm/0.25 μm, Helium; Program: 40 0C (4 min) 2.5 0C/min -> 80 0C 5 0C/min -> 110 0C 10 0C/min -> 220 0C (5 min)
CapillaryDB-Wax1744.Canuti, Conversano, et al., 200930. m/0.25 mm/0.25 μm, Helium; Program: not specified
CapillaryCP-Wax 52 CB1760.Genisheva and Oliveira, 200950. m/0.25 mm/0.20 μm, Helium; Program: 60 0C (5 min) 3 0C/min -> 250 0C (20 min) 1 0C/min -> 255 0C
CapillaryDB-Wax1775.Loscos, Hernandez-Orte, et al., 200960. m/0.25 mm/0.50 μm, Helium; Program: 40 0C (3 min) 10 0C/min -> 90 0C 2 0C/min -> 230 0C (37 min)
CapillaryDB-Wax1758.Zhao, Xu, et al., 200930. m/0.25 mm/0.25 μm, Helium; Program: not specified
CapillaryCP-Wax 52 CB1754.Kaack and Christensen, 200850. m/0.25 mm/0.29 μm, Helium; Program: 33 0C (1 min) 2 0C/min -> 130 0C 10 0C/min -> 220 0C
CapillaryDB-Wax1786.Yongsheng, Hua, et al., 200830. m/0.32 mm/0.25 μm, Helium; Program: 40 0C (4 min) 3 0C/min -> 50 0C 5 0C/min -> 120 0C 7 0C/min -> 175 0C 10 0C/min -> 230 0C (8 min)
CapillaryHP-Innowax FSC1772.Baser K.H.C. and Demirci B., 200760. m/0.25 mm/0.25 μm, N2; Program: 60C(10min) => 4C/min => 220C(10min) => 1C/min => 240C
CapillaryDB-Wax Etr1775.Loskos, Hernandez-Orte, et al., 200760. m/0.25 mm/0.5 μm, He; Program: 40C(3min) => 10C/min => 90C => 2C/min => 230C (37min)
CapillaryDB-Wax1749.Selli, 200730. m/0.32 mm/0.50 μm, Hydrogen; Program: 60 0C (3 min) 2 0C/min -> 220 0C 3 0C/min -> 245 0C (20 min)
CapillaryDB-Wax1767.Wenguang, Wenlai, et al., 200730. m/0.25 mm/0.25 μm; Program: 40 0C (3 min) 3 0C/min -> 150 0C (2 min) 6 0C/min -> 230 0C (10 min)
CapillaryInnowax FSC1772.Kosar, Özek, et al., 200560. m/0.25 mm/0.25 μm, He; Program: 60C(10min) => 4C/min => 220C(10min) => 1C/min => 240C
CapillaryInnowax FSC1772.Baser, Özek, et al., 200460. m/0.25 mm/0.25 μm, He; Program: 60C(10min) => 4C/min => 220C(10min) => 1C/min => 240C
CapillaryCarbowax 20M1764.Vinogradov, 2004Program: not specified
CapillaryCarbowax 20M1753.Vinogradov, 2004Program: not specified
CapillaryInnowax FSC1772.Demirci and Baser, 200360. m/0.25 mm/0.25 μm, He; Program: 60C (10min) => 4C/min => 220C (10min) => 1C/min => 240C
CapillaryDB-Wax1759.Selli, Cabaroglu, et al., 200330. m/0.32 mm/0.5 μm, He; Program: 60C(2min) => 2C/min => 220C => 3C/min => 245C(20min)
CapillaryHP-Innowax1772.Baser, Demirci, et al., 200160. m/0.25 mm/0.25 μm, He; Program: 60 0C (10 min) 10 K/min -> 220 0C (10 min) 1K/min -> 240 0C
CapillaryNukol1757.López and Dufour, 2001N2; Column length: 25. m; Column diameter: 0.25 mm; Program: 45C(5min) => 20C/min => 100C(1min) => 3C/min => 190C(40min)
CapillaryHP-Innowax FSC1772.Tabanca, Kirimer, et al., 200160. m/0.25 mm/0.25 μm; Program: 60C(10min) => 4C/min => 220C(10min) => 1C/min => 240C
CapillaryHP-Innowax FSC1772.Kamariah, Lim, et al., 199960. m/0.25 mm/0.25 μm, He; Program: 60C(10min) => 4C/min => 220C(10min) => 1C/min => 240C(20min)
CapillaryPEG1779.Vas, Gal, et al., 199840. m/0.182 mm/0.30 μm, Hydrogen; Program: 35 0C (5 min) 5 0C/min -> 100 0C 3 0C/min -> 200 0C (1 min) 20 0C/min -> 240 0C (2 min)
CapillaryDB-FFAP1763.Guth, 199730. m/0.32 mm/0.25 μm; Program: 35C (1min) => 40C/min => 60C (1min) => 6C/min => 250C (10min)
CapillaryCP-Wax 52CB1777.López-Tamames, Carro-Mariño, et al., 199725. m/0.3 mm/1.2 μm, H2; Program: 60C(3min) => 2C/min => 220C => 3C/min => 245C
CapillaryCP-Wax 52 CB1777.Carro Marino, López Tamames, et al., 1995H2; Column length: 30. m; Column diameter: 0.32 mm; Program: 60 0C 2 0C/min -> 220 0C 3 0C/min -> 245 0C
CapillaryCarbowax 20M1751.Tirado, Stashenko, et al., 199560. m/0.25 mm/0.25 μm, He; Program: not specified
CapillarySupelcowax1781.Garneau, Bouhajib, et al., 1994Column length: 30. m; Column diameter: 0.25 mm; Program: not specified
CapillaryDB-Wax1735.Marlatt, Ho, et al., 199230. m/0.25 mm/0.25 μm; Program: not specified
CapillaryCarbowax 20M1722.Shibamoto, 1987Program: not specified

Phase change data

Data compiled as indicated in comments:
BS - Robert L. Brown and Stephen E. Stein
TRC - Thermodynamics Research Center, NIST Boulder Laboratories, Chris Muzny director
AC - William E. Acree, Jr., James S. Chickos

Quantity Value Units Method Reference Comment
Tboil495.2KN/AAldrich Chemical Company Inc., 1990BS
Tboil497.55KN/ALecat, 1930Uncertainty assigned by TRC = 0.4 K; not clear that this is a new measurement; TRC
Tboil497.KN/ALecat, 1927Uncertainty assigned by TRC = 1. K; TRC
Quantity Value Units Method Reference Comment
Δvap15.2kcal/molGCHoskovec, Grygarová, et al., 2005Based on data from 343. - 453. K.; AC

Enthalpy of vaporization

ΔvapH (kcal/mol) Temperature (K) Method Reference Comment
17.4308.AStephenson and Malanowski, 1987Based on data from 293. - 333. K.; AC
15.8388.AStephenson and Malanowski, 1987Based on data from 373. - 500. K.; AC

Antoine Equation Parameters

log10(P) = A − (B / (T + C))
    P = vapor pressure (atm)
    T = temperature (K)

View plot Requires a JavaScript / HTML 5 canvas capable browser.

Temperature (K) A B C Reference Comment
339.6 - 494.75.786782711.958-26.552Stull, 1947Coefficents calculated by NIST from author's data.

Enthalpy of sublimation

ΔsubH (kcal/mol) Temperature (K) Reference Comment
15.8308.Serpinskii, Voitkevich, et al., 1954Based on data from 283. - 333. K. See also Jones, 1960.; AC

In addition to the Thermodynamics Research Center (TRC) data available from this site, much more physical and chemical property data is available from the following TRC products:

References

Hoskovec, Grygarová, et al., 2005
Hoskovec, Michal; Grygarová, Dana; Cvacka, Josef; Streinz, Ludvík; Zima, Jirí; Verevkin, Sergey P.; Koutek, Bohumír, Determining the vapour pressures of plant volatiles from gas chromatographic retention data, Journal of Chromatography A, 2005, 1083, 1-2, 161-172, https://doi.org/10.1016/j.chroma.2005.06.006 . [all data]

Tudor, 1997
Tudor, E., Temperature dependence of the retention index for perfumery compounds on a SE-30 glass capillary column. I. Linear equations, J. Chromatogr. A, 1997, 779, 1-2, 287-297, https://doi.org/10.1016/S0021-9673(97)00453-6 . [all data]

Hennig and Engewald, 1994
Hennig, P.; Engewald, W., Influence of adsorption effects on retention indices of selected C10-hydroxy compounds at various temperatures, Chromatographia, 1994, 38, 1/2, 93-97, https://doi.org/10.1007/BF02275733 . [all data]

Pías and Gascó, 1975
Pías, J.B.; Gascó, L., GC Retention Data of Alcohols and Benzoyl Derivatives of Alcohols, J. Chromatogr. - Chrom. Data, 1975, d14-d16. [all data]

Hedin, Thompson, et al., 1972
Hedin, P.A.; Thompson, A.C.; Gueldner, R.C., Application of a Sequential Reduction Regimen to Fractionation of Essential Oils, Anal. Chem., 1972, 44, 7, 1254-1257, https://doi.org/10.1021/ac60315a030 . [all data]

Adams, González Elizondo, et al., 2006
Adams, R.P.; González Elizondo, M.S.; González Elizondo, M.; Slinkman, E., DNA fingerprinting and terpenoid analysis of Juniperus blancoi var. huehuentensis (Cupressaceae), a new subalpine variety from Durango, Mexico, Biochem. Syst. Ecol., 2006, 34, 3, 205-211, https://doi.org/10.1016/j.bse.2005.11.004 . [all data]

Jalali-Heravi, Zekavat, et al., 2006
Jalali-Heravi, M.; Zekavat, B.; Sereshti, H., Characterization of essential oil components of Iranian geranium oil using gas chromatography-mass spectrometry combined with chemometric resolution techniques, J. Chromatogr. A, 2006, 1114, 1, 154-163, https://doi.org/10.1016/j.chroma.2006.02.034 . [all data]

Adams and Nguyen, 2005
Adams, R.P.; Nguyen, S., Infra-specific variation in Juniperus deppeana and F. Sperryi in the Davis Mountains of Texas: variation in leaf essential oils and random amplified polymorphic DNAS (RAPDS), Phytologia, 2005, 87, 2, 96-108. [all data]

Asuming, Beauchamp, et al., 2005
Asuming, W.A.; Beauchamp, P.S.; Descalzo, J.T.; Dev, B.C.; Dev, V.; Frost, S.; Ma, C.W., Essential oil composition of four Lomatium Raf. species and their chemotaxonomy, Biochem. Syst. Ecol., 2005, 33, 1, 17-26, https://doi.org/10.1016/j.bse.2004.06.005 . [all data]

Rajeswara Rao, Kaul, et al., 2005
Rajeswara Rao, B.R.; Kaul, P.N.; Syamasundar, K.V.; Ramesh, S., Chemical profiles of primary and secondary essential oils of palmarosa (Cymbopogon martinii (Roxb.) Wats var. motia Burk.), Ind. Crops Prod., 2005, 21, 1, 121-127, https://doi.org/10.1016/j.indcrop.2004.02.002 . [all data]

Rao, Kaul, et al., 2005
Rao, B.R.R.; Kaul, P.N.; Syamasundar, K.V.; Ramesh, S., Chemical profiles of primary and secondary essential oils of palmarosa (Cymbopogon martinii (Roxb.) Wats var. motia Burk.), Ind. Crops Prod., 2005, 21, 1, 121-127, https://doi.org/10.1016/j.indcrop.2004.02.002 . [all data]

Gauvin, Lecomte, et al., 2004
Gauvin, A.; Lecomte, H.; Smadja, J., Comparative investigations of the essential oils of two scented geranium (Pelargonium spp.) cultivars grown on Reunion Island, Flavour Fragr. J., 2004, 19, 5, 455-460, https://doi.org/10.1002/ffj.1354 . [all data]

Baranauskiene, Venskutonis, et al., 2003
Baranauskiene, R.; Venskutonis, R.P.; Demyttenaere, J.C.R., Sensory and instrumental evaluation of catnip (Nepeta cataria L.) aroma, J. Agric. Food Chem., 2003, 51, 13, 3840-3848, https://doi.org/10.1021/jf021187b . [all data]

Gkinis, Tzakou, et al., 2003
Gkinis, G.; Tzakou, O.; Iliopoulou, D.; Roussis, V., Chemical Composition and Biological Activity of Nepeta parnassica Oils and Isolated Nepetalactones, Z. Naturforsch. C:, 2003, 58, 681-686. [all data]

Nickavar, Salehi-Sormagi, et al., 2002
Nickavar, B.; Salehi-Sormagi, M.H.; Amin, Gh.; Daneshtalab, M., Steam volatiles of Vaccinium arctostaphylos, Pharm. Biol., 2002, 40, 6, 448-449, https://doi.org/10.1076/phbi.40.6.448.8449 . [all data]

Rajeswara Rao, Kaul, et al., 2002
Rajeswara Rao, B.R.; Kaul, P.N.; Syamasundar, K.V.; Ramesh, S., Water soluble fractions of rose scented geranium (Pelargonium species) essential oil, Bioresour. Technol., 2002, 84, 3, 243-246, https://doi.org/10.1016/S0960-8524(02)00057-3 . [all data]

Rajeswara Rao, 2002
Rajeswara Rao, B.R., Biomass yield, essential oil yield and essential oil composition of rose-scented geranium (Pelargonium species) as influenced by row spacings and intercropping with cornmint (Mentha arvensis L.f. piperascens Malinv. ex Holmes), Ind. Crops Prod., 2002, 16, 2, 133-144, https://doi.org/10.1016/S0926-6690(02)00038-9 . [all data]

Rao B.R.R., 2002
Rao B.R.R., Biomass yield, essential oil yield and essential oil composition of rose-scented geranium (Pelargonium species) as influenced by row spacings and intercropping with cornmint (Mentha arvensis L.f. piperascens Malinv. ex Holmes), Industrial Crops and Products, 2002, 16, 2, 133-144, https://doi.org/10.1016/S0926-6690(02)00038-9 . [all data]

Jain, Aggarwal, et al., 2001
Jain, N.; Aggarwal, K.K.; Syamasundar, K.V.; Srivastava, S.K.; Kumar, S., Essential oil composition of geranium (Pelargonium sp.) from the plains of Northern India, Flavour Fragr. J., 2001, 16, 1, 44-46, https://doi.org/10.1002/1099-1026(200101/02)16:1<44::AID-FFJ943>3.0.CO;2-X . [all data]

Rajeswara Rao, 2001
Rajeswara Rao, B.R., Biomass and essential oil yields of rainfed palmarosa (Cymbopogon martinii (Roxb.) Wats. var. motia Burk.) supplied with different levels of organic manure and fertilizer nitrogen in semi-arid tropical climate, Ind. Crops Prod., 2001, 14, 3, 171-178, https://doi.org/10.1016/S0926-6690(01)00081-4 . [all data]

Abella, Cortella, et al., 2000
Abella, L.; Cortella, A.R.; Velasco-Negueruela, A.; Pérez-Alonso, M.J., Ethnobotany, volatile oils and secretion tissues of Werneria poposa from Argentina, Pharm. Biol., 2000, 38, 3, 197-203, https://doi.org/10.1076/1388-0209(200007)3831-SFT197 . [all data]

Adams, 2000
Adams, R.P., Systematics of smooth leaf margin Juniperus of the western hemisphere based on leaf essential oils and RAPD DNA fingerprinting, Biochem. Syst. Ecol., 2000, 28, 2, 149-162, https://doi.org/10.1016/S0305-1978(99)00047-2 . [all data]

Adams, 2000, 2
Adams, R.P., Systematics of Juniperus section Juniperus based on leaf essential oils and random amplified polymorphic DNAs (RAPDs), Biochem. Syst. Ecol., 2000, 28, 6, 515-528, https://doi.org/10.1016/S0305-1978(99)00089-7 . [all data]

Adams, 2000, 3
Adams, R.P., Systematics of the one seeded Juniperus of the eastern hemisphere based on leaf essential oils and random amplified polymorphic DNAs (RAPDs), Biochem. Syst. Ecol., 2000, 28, 6, 529-543, https://doi.org/10.1016/S0305-1978(99)00096-4 . [all data]

Adams, 2000, 4
Adams, R.P., The serrate leaf margined Juniperus (Section Sabina) of the western hemisphere: systematics and evolution based on leaf essential oils and Random Amplified Polymorphic DNAs (RAPDs), Biochem. Syst. Ecol., 2000, 28, 10, 975-989, https://doi.org/10.1016/S0305-1978(00)00022-3 . [all data]

Rao, Kaul, et al., 2000
Rao, B.R.R.; Kaul, P.N.; Mallavarapu, G.R.; Ramesh, S., First observation of little leaf disease and its impact on the yield and composition of the essential oil of rose-scented geranium (Pelargonium sp.), Flavour Fragr. J., 2000, 15, 3, 137-140, https://doi.org/10.1002/1099-1026(200005/06)15:3<137::AID-FFJ880>3.0.CO;2-A . [all data]

Rao, Rout, et al., 2000
Rao, Y.R.; Rout, P.K.; Jena, K.S.; Sahu, S.B., Composition of essential oil of citronella (Cymbopogon winterianus jowitt) grown in coastal Orissa, Fafai J., 2000, 2, 4, 29-31. [all data]

Rao, Sastry, et al., 2000
Rao, B.R.R.; Sastry, K.P.; Saleem, S.M.; Rao, E.V.S.P.; Syamasundar, K.V.; Ramesh, S., Volatile flower oils of three genotypes of rose-scented geranium (Pelargonium sp.), Flavour Fragr. J., 2000, 15, 2, 105-107, https://doi.org/10.1002/(SICI)1099-1026(200003/04)15:2<105::AID-FFJ875>3.0.CO;2-G . [all data]

Adams, 1999
Adams, R.P., Systematics of multi-seeded eastern hemisphere Juniperus based on leaf essential oils and RAPD DNA fingerprinting, Biochem. Syst. Ecol., 1999, 27, 7, 709-725, https://doi.org/10.1016/S0305-1978(99)00016-2 . [all data]

Kaul, Gujral, et al., 1999
Kaul, V.K.; Gujral, R.K.; Singh, B., Volatile constituents of the essential oil of flowers of Rosa brunonii Lindl, Flavour Fragr. J., 1999, 14, 1, 9-11, https://doi.org/10.1002/(SICI)1099-1026(199901/02)14:1<9::AID-FFJ761>3.0.CO;2-C . [all data]

Kulkarni, Mallavarapu, et al., 1998
Kulkarni, R.N.; Mallavarapu, G.R.; Baskaran, K.; Ramesch, S.; Kumar, S., Composition of the essential oils of two isomenthone-rich variants of geranium (Pelargonium sp.), Flavour Fragr. J., 1998, 13, 6, 389-392, https://doi.org/10.1002/(SICI)1099-1026(199811/12)13:6<389::AID-FFJ757>3.0.CO;2-2 . [all data]

Mallavarapu, Rao, et al., 1998
Mallavarapu, G.R.; Rao, B.R.R.; Kaul, P.N.; Ramesh, S.; Bhattacharya, A.K., Volatile constituents of the essential oils of the seeds and the herb of palmarosa (Cymbopogon martinii (Roxb.) Wats. var. motia Burk.), Flavour Fragr. J., 1998, 13, 3, 167-169, https://doi.org/10.1002/(SICI)1099-1026(199805/06)13:3<167::AID-FFJ719>3.0.CO;2-B . [all data]

Jantan, Ahmad, et al., 1996
Jantan, I.; Ahmad, A.S.; Ahmad, A.R.; Ali, N.A.M.; Ayop, N., Chemical composition of some citrus oils from Malaysia, J. Essent. Oil Res., 1996, 8, 6, 627-632, https://doi.org/10.1080/10412905.1996.9701030 . [all data]

Padrayuttawat, Tamura, et al., 1996
Padrayuttawat, A.; Tamura, H.; Yamao, M., A split injection system for the analysis of purge and trap headspace of the volatile components in Citrus sudachi, J. Hi. Res. Chromatogr., 1996, 19, 6, 365-369, https://doi.org/10.1002/jhrc.1240190613 . [all data]

Raharivelomanana, Cambon, et al., 1993
Raharivelomanana, P.; Cambon, A.; Azzaro, M.; Bianchini, J.-P.; Claude-Lafontaine, A.; George, G., Volatile Constituents of Neocallitropsis pancheri (Carriere) de Laubenfels Heartwood Extracts (Cupressaceae), J. Essent. Oil Res., 1993, 5, 6, 587-595, https://doi.org/10.1080/10412905.1993.9698289 . [all data]

Raina, Srivastava, et al., 2003
Raina, V.K.; Srivastava, S.K.; Aggarwal, K.K.; Syamasunder, K.V.; Khanuja, S.P.S., Essential oil composition of Cymbopogon martinii from different places in India, Flavour Fragr. J., 2003, 18, 4, 312-315, https://doi.org/10.1002/ffj.1222 . [all data]

Rao, Kaul, et al., 2003
Rao, B.R.R.; Kaul, P.N.; Syamasundar, K.V.; Ramesh, S., Comparative composition of decanted and recovered essential oils of Eucalyptus citriodora Hook, Flavour Fragr. J., 2003, 18, 2, 133-135, https://doi.org/10.1002/ffj.1157 . [all data]

Shellie and Marriott, 2003
Shellie, R.A.; Marriott, P.J., Comprehensive two-dimensional gas chromatography-mass spectrometry analysis of Pelargonium graveolens essential oil using rapid scanning quadrupole mass spectrometry, Analyst, 2003, 128, 7, 879-883, https://doi.org/10.1039/b304371a . [all data]

Adams, 1998
Adams, R.P., The essential oils and chemotaxonomy of Juniperus sect. Juniperus, Biochem. Syst. Ecol., 1998, 26, 6, 637-645, https://doi.org/10.1016/S0305-1978(98)00020-9 . [all data]

ter Heide, 1976
ter Heide, R., Studies on Terpenes. III. Gas Chromatography of Acyclic Monoterpene Alcohols, J. Chromatogr., 1976, 129, 143-154, https://doi.org/10.1016/S0021-9673(00)87776-6 . [all data]

Sakai, Maarse, et al., 1967
Sakai, T.; Maarse, H.; Kepner, R.E.; Jennings, W.G.; Longhurst, W.M., Volatile components of Douglas fir needles, J. Agric. Food Chem., 1967, 15, 6, 1070-1072, https://doi.org/10.1021/jf60154a027 . [all data]

Tressl, Friese, et al., 1978
Tressl, R.; Friese, L.; Fendesack, F.; Köppler, H., Gas chromatographic--mass spectrometric investigation of hop aroma constituents in beer, J. Agric. Food Chem., 1978, 26, 6, 1422-1426, https://doi.org/10.1021/jf60220a037 . [all data]

Benzo, Gilardoni, et al., 2007
Benzo, M.; Gilardoni, G.; Gandini, C.; Caccialanza, G.; Finzi, P.V.; Vidari, G.; Abdo, S.; Layedra, P., Determination of the threshold odor concentration of main odorants in essential oils using gas chromatography-olfactometry incremental dilution technique, J. Chromatogr. A, 2007, 1150, 1-2, 131-135, https://doi.org/10.1016/j.chroma.2007.02.031 . [all data]

Boti, Koukoua, et al., 2007
Boti, J.B.; Koukoua, G.; N'Guessan, T.Y.; Casanova, J., Chemical variability of Conyza sumatrensis and Microglossa pyrifolia from Côte d'Ivoire, Flavour Fragr. J., 2007, 22, 1, 27-31, https://doi.org/10.1002/ffj.1743 . [all data]

Duquesnoy, Castola, et al., 2007
Duquesnoy, E.; Castola, V.; Casanova, J., Composition and chemical variability of the twig oil of Abies alba Miller from Corsica, Flavour Fragr. J., 2007, 22, 4, 293-299, https://doi.org/10.1002/ffj.1796 . [all data]

Hongratanaworakit and Buchbauer, 2007
Hongratanaworakit, T.; Buchbauer, G., Chemical composition and stimulating effect of Citrus hystrix oil on humans, Flavour Fragr. J., 2007, 22, 5, 443-449, https://doi.org/10.1002/ffj.1820 . [all data]

Mondello, Sciarrone, et al., 2007
Mondello, L.; Sciarrone, D.; Casilli, A.; Tranchida, P.Q.; Dugo, P.; Dugo, G., Fast gas chromatography-full scan quadrupole mass spectrometry for the determination of allergens in fragrances, J. Sep. Sci., 2007, 30, 12, 1905-1911, https://doi.org/10.1002/jssc.200600541 . [all data]

Rocha, Coelho, et al., 2007
Rocha, S.M.; Coelho, E.; Zrostlikova, J.; Delgadillo, I.; Coimbra b, M.A., Comprehensive two-dimensional gas chromatography with time-of-flight mass spectrometry of monoterpenoids as a powerful tool for grape origin traceability, J. Chromatogr. A, 2007, 1161, 1-2, 292-299, https://doi.org/10.1016/j.chroma.2007.05.093 . [all data]

Gonny, Cavaleiro, et al., 2006
Gonny, M.; Cavaleiro, C.; Salgueiro, L.; Casanova, J., Analysis of Juniperus communis subsp. alpina needle, berry, wood and root oils by combination of GC, GC/MS and 13C-NMR, Flavour Fragr. J., 2006, 21, 1, 99-106, https://doi.org/10.1002/ffj.1527 . [all data]

Kukic J., Petrovic S., et al., 2006
Kukic J.; Petrovic S.; Pavlovic M.; Couladis M.; Tzakou O.; Niketic M., Composition of essential oil of Stachys alpina L. ssp dinarica Murb., Flavour Fragr. J., 2006, 21, 3, 539-542, https://doi.org/10.1002/ffj.1684 . [all data]

Su, Ho, et al., 2006
Su, Y.-C.; Ho, C.-L.; Wang, E.I.-C.; Chang, S.-T., Antifungal activities and chemical compositions of essential oils from leaves of four eucalypts, Taiwan J. For. Sci., 2006, 21, 1, 49-61. [all data]

Dugo, Mondello, et al., 2005
Dugo, P.; Mondello, L.; Favoino, O.; Cicero, L.; Rodriguez Zenteno, N.A.; Dugo, G., Characterization of cold-pressed Mexican dancy tangerine oils, Flavour Fragr. J., 2005, 20, 1, 60-66, https://doi.org/10.1002/ffj.1367 . [all data]

Fanciullino, Gancel, et al., 2005
Fanciullino, A.-L.; Gancel, A.-L.; Froelicher, Y.; Luro, F.; Ollitrault, P.; Brillouet, J.-M., Effects of Nucleo-cytoplasmic Interactions on Leaf Volatile Compounds from Citrus Somatic Diploid Hybrids, J. Agric. Food Chem., 2005, 53, 11, 4517-4523, https://doi.org/10.1021/jf0502855 . [all data]

Gancel, Ollitrault, et al., 2005
Gancel, A.-L.; Ollitrault, P.; Froelicher, Y.; Tomi, F.; Jacquemond, C.; Luro, F.; Brillouet, J.-M., Leaf volatile compounds of six citrus somatic allotetraploid hybrids originating from various combinations of lime, lemon, citron, sweet orange, and grapefruit, J. Agric. Food Chem., 2005, 53, 6, 2224-2230, https://doi.org/10.1021/jf048315b . [all data]

Smadja, Rondeau, et al., 2005
Smadja, J.; Rondeau, P.; Sing, A.S.C., Volatile constituents of five Citrus Petitgrain essential oils from Reunion, Flavour Fragr. J., 2005, 20, 4, 399-402, https://doi.org/10.1002/ffj.1438 . [all data]

Bell, 2004
Bell, W.A.-M., Examination of Aroma Volatiles Formed from Thermal Processing of Florida Reconstituted Grapefruit Juice. A Thesis presented to the graduate school of the university of Florida in partial fulfillment of the requirements for the degree of master of science, 2004. [all data]

Bertoli, Pistelli, et al., 2004
Bertoli, A.; Pistelli, L.; Morelli, I.; Fraternale, D.; Giamperi, L.; Ricci, D., Volatile constituents of different parts (roots, stems and leaves) of Smyrnium olusatrum L., Flavour Fragr. J., 2004, 19, 6, 522-525, https://doi.org/10.1002/ffj.1382 . [all data]

Dugo, Mondello, et al., 2004
Dugo, P.; Mondello, L.; Zappia, G.; Bonaccorsi, I.; Cotroneo, A.; Russo, M.T., The composition of the volatile fraction and the enantiomeric distribution of five volatile components of faustrime oil (Monocitrus australatica x Fortunella sp. x Citrus aurantifolia), J. Essent. Oil Res., 2004, 16, 4, 328-333, https://doi.org/10.1080/10412905.2004.9698734 . [all data]

Gocmen, Gurbuz, et al., 2004
Gocmen, D.; Gurbuz, O.; Rouseff, R.L.; Smoot, J.M.; Dagdelen, A.F., Gas chromatographic-olfactometric characterization of aroma active compounds in sun-dried and vacuum-dried tarhana, Eur. Food Res. Technol., 2004, 218, 6, 573-578, https://doi.org/10.1007/s00217-004-0913-6 . [all data]

Isidorov, Krajewska, et al., 2004
Isidorov, V.A.; Krajewska, U.; Vinogorova, V.T.; Vetchinnikova, L.V.; Fuksman, I.L.; Bal, K., Gas chromatographic analysis of essential oil from buds of different birch species with preliminary partition of components, Biochem. Syst. Ecol., 2004, 32, 1, 1-13, https://doi.org/10.1016/S0305-1978(03)00175-3 . [all data]

Mardarowicz, Wianowska, et al., 2004
Mardarowicz, M.; Wianowska, D.; Dawidowicz, A.L.; Sawicki, R., The influence of sample treatment on SPME extracts from conifers. I. Comparison of terpene composition in Engelmann Spruce (Picea engelmanii) using hydrodistillation, SPME and PLE, Annales Universitatis Mariae Curie-Sklodowska Lublin - Polonia, 2004, 59, 3, 25-42. [all data]

Raina, Kumar, et al., 2004
Raina, V.K.; Kumar, A.; Srivastava, S.K.; Syamsundar, K.V.; Kahol, A.P., Essential oil composition of 'kewda' (Pandanus odoratissimus) from India, Flavour Fragr. J., 2004, 19, 5, 434-436, https://doi.org/10.1002/ffj.1331 . [all data]

Stashenko, Jaramillo, et al., 2004
Stashenko, E.E.; Jaramillo, B.E.; Martínez, J.R., Analysis of volatile secondary metabolites from Colombian Xylopia aromatica (Lamarck) by different extraction and headspace methods and gas chromatography, J. Chromatogr. A, 2004, 1025, 1, 105-113, https://doi.org/10.1016/j.chroma.2003.10.059 . [all data]

Yu, Kim, et al., 2004
Yu, E.J.; Kim, T.H.; Kim, K.H.; Lee, H.J., Characterization of aroma-active compounds of Abies nephrolepis (Khingan fir) needles using aroma extract dilution analysis, Flavour Fragr. J., 2004, 19, 1, 74-79, https://doi.org/10.1002/ffj.1314 . [all data]

Cavaleiro, Salgueiro, et al., 2003
Cavaleiro, C.; Salgueiro, L.R.; da Cunha, A.P.; Figueiredo, A.C.; Barroso, J.G.; Bighelli, A.; Casanova, J., Composition and variability of the essential oils of the leaves and berries from Juniperus navicularis, Biochem. Syst. Ecol., 2003, 31, 2, 193-201, https://doi.org/10.1016/S0305-1978(02)00080-7 . [all data]

Chisholm, Jell, et al., 2003
Chisholm, M.G.; Jell, J.A.; Cass, D.M., Jr., Characterization of the major odorants found in the peel oil of Citrus reticulata Blanco cv. Clementine using gas chromatography-olfactometry, Flavour Fragr. J., 2003, 18, 4, 275-281, https://doi.org/10.1002/ffj.1188 . [all data]

Chisholm, Wilson, et al., 2003
Chisholm, M.G.; Wilson, M.A.; Gaskey, G.M., Characterization of aroma volatiles in key lime essential oils (Cirtrus aurantifolia Swingle), Flavour Fragr. J., 2003, 18, 2, 106-115, https://doi.org/10.1002/ffj.1172 . [all data]

Gancel, Ollitrault, et al., 2003
Gancel, A.-L.; Ollitrault, P.; Froelicher, Y.; Tomi, F.; Jacquemond, C.; Luro, F.; Brillouet, J.-M., Leaf volatile compounds of seven citrus somatic tetraploid hybrids sharing willow leaf mandarin (Citrus deliciosa Ten.) as their common parent, J. Agric. Food Chem., 2003, 51, 20, 6006-6013, https://doi.org/10.1021/jf0345090 . [all data]

Högnadóttir and Rouseff, 2003
Högnadóttir, Á.; Rouseff, R.L., Identification of aroma active compounds in organce essence oil using gas chromatography-olfactometry and gas chromatography-mass spectrometry, J. Chromatogr. A, 2003, 998, 1-2, 201-211, https://doi.org/10.1016/S0021-9673(03)00524-7 . [all data]

Sun and Stremple, 2003
Sun, G.; Stremple, P., Retention index characterization of flavor, fragrance, and many other compounds on DB-1 and DB-XLB, 2003, retrieved from http://www.chem.agilent.com/cag/cabu/pdf/b-0279.pdf. [all data]

Verzera, Trozzi, et al., 2003
Verzera, A.; Trozzi, A.; Gazea, F.; Cicciarelloi, G.; Cotroneo, A., Effects of rootstock on the composition of bergamot (Citrus bergamia Risso et Poiteau) essential oil, J. Agric. Food Chem., 2003, 51, 1, 206-210, https://doi.org/10.1021/jf0206872 . [all data]

Lota, de Rocca Serra, et al., 2002
Lota, M.-L.; de Rocca Serra, D.; Tomi, F.; Jacquemond, C.; Casanova, J., Volatile components of peel and leaf oils of lemon and lime species, J. Agric. Food Chem., 2002, 50, 4, 796-805, https://doi.org/10.1021/jf010924l . [all data]

Mondello, Zappia, et al., 2002
Mondello, L.; Zappia, G.; Cotroneo, A.; Bonaccorsi, I.; Chowdhury, J.U.; Yusuf, M.; Dugo, G., Studies on the essential oil-bearing plants of Bangladesh. Part VIII. Composition of some Ocimum oils O. basilicum L. var. purpurascens; O. sanctum L. green; O. sanctum L. purple; O. americanum L., citral type; O. americanum L., camphor type, Flavour Fragr. J., 2002, 17, 5, 335-340, https://doi.org/10.1002/ffj.1108 . [all data]

Nath, Sarma, et al., 2002
Nath, S.C.; Sarma, K.K.; Vajezikova, I.; Leclercq, P.A., Comparison of volatile inflorescence oils and taxonomy of certain Cymbopogon taxa described as Cymbopogon flexuosus (Nees ex Steud.) Wats., Biochem. Syst. Ecol., 2002, 30, 2, 151-162, https://doi.org/10.1016/S0305-1978(01)00066-7 . [all data]

Pintore, Usai, et al., 2002
Pintore, G.; Usai, M.; Bradesi, P.; Juliano, C.; Boatto, G.; Tomi, F.; Chessa, M.; Cerri, R.; Casanova, J., Chemical composition and antimicrobial activity of Rosmarinus officinalis L. oils from Sardinia and Corsica, Flavour Fragr. J., 2002, 17, 1, 15-19, https://doi.org/10.1002/ffj.1022 . [all data]

Hudaib, Grazia Bellardi, et al., 2001
Hudaib, M.; Grazia Bellardi, M.; Rubies-Autonell, C.; Fiori, J.; Cavrini, V., Chromatographic (GC-MS, HPLC) and virological evaluations of Salvia sclarea infected by BBWV-I, Farmaco, 2001, 56, 3, 219-227, https://doi.org/10.1016/S0014-827X(01)01038-2 . [all data]

Lin and Rouseff, 2001
Lin, J.; Rouseff, R.L., Characterization of aroma-impact compounds in cold-pressed grapefruit oil using time-intensity GC-olfactometry and GC-MS, Flavour Fragr. J., 2001, 16, 6, 457-463, https://doi.org/10.1002/ffj.1041 . [all data]

Lota, Serra, et al., 2001
Lota, M.-L.; Serra, D.R.; Jacquemond, C.; Tomi, F.; Casanova, J., Chemical variability of peel and leaf essential oils of sour orange, Flavour Fragr. J., 2001, 16, 2, 89-96, https://doi.org/10.1002/1099-1026(200103/04)16:2<89::AID-FFJ950>3.0.CO;2-D . [all data]

Rezzi, Cavaleiro, et al., 2001
Rezzi, S.; Cavaleiro, C.; Bighelli, A.; Salgueiro, L.; da Cunha, A.P.; Casanova, J., Intraspecific chemical variability of the leaf essential oil of Juniperus phoenicea subsp. turbinata from Corsica, Biochem. Syst. Ecol., 2001, 29, 2, 179-188, https://doi.org/10.1016/S0305-1978(00)00044-2 . [all data]

Alonzo, Bosco, et al., 2000
Alonzo, G.; Bosco, S.F.D.; Palazzolo, E.; Saiano, F.; Tusa, N., Citrus somatic hybrid leaf essential oil, Flavour Fragr. J., 2000, 15, 4, 258-262, https://doi.org/10.1002/1099-1026(200007/08)15:4<258::AID-FFJ906>3.0.CO;2-F . [all data]

Bartley and Jacobs, 2000
Bartley, J.P.; Jacobs, A.L., Effects of drying on flavour compounds in Australian-grown ginger (Zingiber officinale), J. Sci. Food Agric., 2000, 80, 2, 209-215, https://doi.org/10.1002/(SICI)1097-0010(20000115)80:2<209::AID-JSFA516>3.0.CO;2-8 . [all data]

Lota, de Rocca Serra, et al., 2000
Lota, M.-L.; de Rocca Serra, D.; Tomi, F.; Casanova, J., Chemical variability of peel and leaf essential oils of mandarins from Citrus reticulata Blanco, Biochem. Syst. Ecol., 2000, 28, 1, 61-78, https://doi.org/10.1016/S0305-1978(99)00036-8 . [all data]

Paramonov, Khalilova, et al., 2000
Paramonov, E.A.; Khalilova, A.Z.; Odinokov, V.N.; Khalilov, L.M., Identification and biological activity of volatile organic compounds isolated from plants and insects. III. Chromatography-mass spectrometry of volatile compoundsof Aegopodium podagraria, Chem. Nat. Compd. (Engl. Transl.), 2000, 36, 6, 584-586, https://doi.org/10.1023/A:1017563708858 . [all data]

Verzera, la Rosa, et al., 2000
Verzera, A.; la Rosa, G.; Zappalà, M.; Cotroneo, A., Essential oil composition of different cultivars of bergamot grown in Sicily, Ital. J. Food Sci., 2000, 12, 4, 493-501. [all data]

Verzera, Trozzi, et al., 2000
Verzera, A.; Trozzi, A.; Cotroneo, A.; Lorenzo, D.; Dellacassa, E., Uruguayan essential oil. 12. Composition of Nova and Satsuma mandarin oils, J. Agric. Food Chem., 2000, 48, 7, 2903-2909, https://doi.org/10.1021/jf990734z . [all data]

Chassagne, Boulanger, et al., 1999
Chassagne, D.; Boulanger, R.; Crouzet, J., Enzymatic hydrolysis of edible Passiflora fruit glycosides, Food Chem., 1999, 66, 3, 281-288, https://doi.org/10.1016/S0308-8146(99)00044-8 . [all data]

Lota, Serra, et al., 1999
Lota, M.-L.; Serra, D.R.; Tomi, F.; Bessiere, J.-M.; Casanova, J., Chemical composition of peel and leaf essential oils of Citrus medica L. and C. limonimedica Lush., Flavour Fragr. J., 1999, 14, 3, 161-166, https://doi.org/10.1002/(SICI)1099-1026(199905/06)14:3<161::AID-FFJ801>3.0.CO;2-8 . [all data]

Weyerstahl, Marschall, et al., 1999
Weyerstahl, P.; Marschall, H.; Wahlburg, H.-C.; Christiansen, C.; Rustaiyan, A.; Mirdjalili, F., Constituents of the essential oil of Pulicaria gnaphalodes (Vent.) Boiss. from Iran, Flavour Fragr. J., 1999, 14, 2, 121-130, https://doi.org/10.1002/(SICI)1099-1026(199903/04)14:2<121::AID-FFJ790>3.0.CO;2-K . [all data]

Píry, Príbela, et al., 1995
Píry, J.; Príbela, A.; Durcanská, J.; Farkas, P., Fractionation of volatiles from blackcurrant (Ribes nigrum L.) by different extractive methods, Food Chem., 1995, 54, 1, 73-77, https://doi.org/10.1016/0308-8146(95)92665-7 . [all data]

Chung, Eiserich, et al., 1993
Chung, T.Y.; Eiserich, J.P.; Shibamoto, T., Volatile compounds isolated from edible Korean chamchwi (Aster scaber Thunb), J. Agric. Food Chem., 1993, 41, 10, 1693-1697, https://doi.org/10.1021/jf00034a033 . [all data]

Yang, Sugisawa, et al., 1992
Yang, R.; Sugisawa, H.; Nakatani, H.; Tamura, H.; Takagi, N., Comparison of odor quality in peel oils of acid citrus, Nippon Shokuhin Kogyo Gakkaishi, 1992, 39, 1, 16-24, https://doi.org/10.3136/nskkk1962.39.16 . [all data]

Chang, Sheng, et al., 1989
Chang, L.P.; Sheng, L.S.; Yang, M.Z.; An, D.K., Retention index of essential oil in temperature-programmed capillary column gas chromatography, Acta Pharm. Sin., 1989, 24, 11, 847-852. [all data]

Pieribattesti, Smadja, et al., 1988
Pieribattesti, J.C.; Smadja, J.; Mondon, J.M., Composition of the essential oil of cardamom (Elettaria cardamomum maton) in Flavors and Fragrances: A World Perspective. Proceedings of the 10th International Congress of Essential Oils, Fragrances and Flavors, Lawrence,B.M.; Mookherjee,B.D.; Willis,B.J., ed(s)., Elsevier, New York, 1988, 697-706. [all data]

Halket and Schulten, 1985
Halket, J.M.; Schulten, H.-R., Thick-film capillary column gas chromatography-field ionization mass spectrometry: A complementary technique for the rapid analysis of volatiles, J. Chromatogr., 1985, 322, 200-205, https://doi.org/10.1016/S0021-9673(01)97672-1 . [all data]

Andriamaharavo, 2014
Andriamaharavo, N.R., Retention Data. NIST Mass Spectrometry Data Center., NIST Mass Spectrometry Data Center, 2014. [all data]

Tret'yakov, 2008
Tret'yakov, K.V., Retention Data. NIST Mass Spectrometry Data Center., NIST Mass Spectrometry Data Center, 2008. [all data]

Dharmawan, Kasapis, et al., 2007
Dharmawan, J.; Kasapis, S.; Curran, P.; Johnson, J.R., Characterization of volatile compounds in selected citrus fruits from Asia. Part I: freshly-squeezed juice, Flavour Fragr. J., 2007, 22, 3, 228-232, https://doi.org/10.1002/ffj.1790 . [all data]

Tret'yakov, 2007
Tret'yakov, K.V., Retention Data. NIST Mass Spectrometry Data Center., NIST Mass Spectrometry Data Center, 2007. [all data]

Mondello, Casilli, et al., 2005
Mondello, L.; Casilli, A.; Tranchida, P.Q.; Dugo, G.; Dugo, P., Comprehensive two-dimensional gas chromatography in combination with rapid scanning quadrupole mass spectrometry in perfume analysis, J. Chromatogr. A, 2005, 1067, 1-2, 235-243, https://doi.org/10.1016/j.chroma.2004.09.040 . [all data]

Sacchetti, Maietti, et al., 2005
Sacchetti, G.; Maietti, S.; Muzzoli, M.; Scaglianti, M.; Manfredini, S.; Radice, M.; Bruni, R., Comparative evaluation of 11 essential oils of different origin as functional antioxidants, antiradicals and antimicrobials in foods, Food Chem., 2005, 91, 4, 621-632, https://doi.org/10.1016/j.foodchem.2004.06.031 . [all data]

Wang, Finn, et al., 2005
Wang, Y.; Finn, C.; Qian, M.C., Impact of Growing Environment on Chickasaw Blackberry ( Rubus L.) Aroma Evaluated by Gas Chromatography Olfactometry Dilution Analysis, J. Agric. Food Chem., 2005, 53, 9, 3563-3571, https://doi.org/10.1021/jf048102m . [all data]

Frizzo, Lorenzo, et al., 2004
Frizzo, C.D.; Lorenzo, D.; Dellacassa, E., Composition and seasonal variation of the essential oils from two mandarin cultivars of Southern Brazil, J. Agric. Food Chem., 2004, 52, 10, 3036-3041, https://doi.org/10.1021/jf030685x . [all data]

Lorenzo, Loayza, et al., 2003
Lorenzo, D.; Loayza, I.; Dellacassa, E., Composition of the essential oils from leaves of two Hedyosmum spp. from Bolivia, Flavour Fragr. J., 2003, 18, 1, 32-35, https://doi.org/10.1002/ffj.1146 . [all data]

Boulanger and Crouzet, 2000
Boulanger, R.; Crouzet, J., Free and bound flavour components of Amazonian fruits: 3-glycosidically bound components of cupuacu, Food Chem., 2000, 70, 4, 463-470, https://doi.org/10.1016/S0308-8146(00)00112-6 . [all data]

Lorenzo, Dellacassa, et al., 2000
Lorenzo, D.; Dellacassa, E.; Atti-Serafini, L.; Santos, A.C.; Frizzo, C.; Paroul, N.; Moyna, P.; Mondello, L.; Dugo, G., Composition and stereoanalysis of Cymbopogon winterianus Jowitt oil from Southern Brazil, Flavour Fragr. J., 2000, 15, 3, 177-181, https://doi.org/10.1002/1099-1026(200005/06)15:3<177::AID-FFJ887>3.0.CO;2-M . [all data]

Boulanger, Chassagne, et al., 1999
Boulanger, R.; Chassagne, D.; Crouzet, J., Free and bound flavour components of amazonian fruits. 1: Bacuri, Flavour Fragr. J., 1999, 14, 5, 303-311, https://doi.org/10.1002/(SICI)1099-1026(199909/10)14:5<303::AID-FFJ834>3.0.CO;2-C . [all data]

Tairu, Hofmann, et al., 1999
Tairu, A.O.; Hofmann, T.; Schieberle, P., Characterization of the key aroma compounds in dried fruits of the West African peppertree Xylopia aethiopica (Dunal) A. Rich (Annonaceae) using aroma extract dilution analysis, J. Agric. Food Chem., 1999, 47, 8, 3285-3287, https://doi.org/10.1021/jf990228+ . [all data]

Tairu, Hofmann, et al., 1999, 2
Tairu, A.O.; Hofmann, T.; Schieberle, P., Identification of the key aroma compounds in dried fruits of Xylopia aethiopica in Perspectives on new crops and new users, Janick, J., ed(s)., ASHS Press, Alexandria, VA, USA, 1999, 474-478. [all data]

Mondello, Dugo, et al., 1995
Mondello, L.; Dugo, P.; Basile, A.; Dugo, G., Interactive use of linear retention indices, on polar and apolar columns, with a MS-library for reliable identification of complex mixtures, J. Microcolumn Sep., 1995, 7, 6, 581-591, https://doi.org/10.1002/mcs.1220070605 . [all data]

Ugliano, Bartowsky, et al., 2006
Ugliano, M.; Bartowsky, E.J.; McCarthy, J.; Moio, L.; Henschke, P.A., Hydrolysis and Transformation of Grape Glycosidically Bound Volatile Compounds during Fermentation with Three Saccharomyces Yeast Strains, J. Agric. Food Chem., 2006, 54, 17, 6322-6331, https://doi.org/10.1021/jf0607718 . [all data]

Varming, Andersen, et al., 2006
Varming, C.; Andersen, M.L.; Poll, L., Volatile Monoterpenes in Black Currant (Ribes nigrum L.) Juice: Effects of Heating and Enzymatic Treatment by β-Glucosidase, J. Agric. Food Chem., 2006, 54, 6, 2298-2302, https://doi.org/10.1021/jf051938k . [all data]

Choi, 2005
Choi, H.-S., Characteristic odor components of kumquat (Fortunella japonica Swingle) peel oil, J. Agric. Food Chem., 2005, 53, 5, 1642-1647, https://doi.org/10.1021/jf040324x . [all data]

Fang and Qian, 2005
Fang, Y.; Qian, M., Aroma compounds in Oregon Pinot Noir wine determined by aroma extract dilution analysis (AEDA), Flavour Fragr. J., 2005, 20, 1, 22-29, https://doi.org/10.1002/ffj.1551 . [all data]

Pena, Barciela, et al., 2005
Pena, R.M.; Barciela, J.; Herrero, C.; Garcia-Martin, S., Optimization of solid-phase microextraction methods for GC-MS determination of terpenes in wine, J. Sci. Food Agric., 2005, 85, 7, 1227-1234, https://doi.org/10.1002/jsfa.2121 . [all data]

Brophy, Goldsack, et al., 2004
Brophy, J.J.; Goldsack, R.J.; O'Sullivan, W., Chemistry of the Australian gymnosperms. Part VII. The leaf oils of the genus Actinostrobus, Biochem. Syst. Ecol., 2004, 32, 10, 867-873, https://doi.org/10.1016/j.bse.2004.05.001 . [all data]

Ledauphin, Saint-Clair, et al., 2004
Ledauphin, J.; Saint-Clair, J.-F.; Lablanquie, O.; Guichard, H.; Founier, N.; Guichard, E.; Barillier, D., Identification of trace volatile compounds in freshly distilled calvados and cognac using preparative separations coupled with gas chromatography-mass spectrometry, J. Agric. Food Chem., 2004, 52, 16, 5124-5134, https://doi.org/10.1021/jf040052y . [all data]

Choi, 2003
Choi, H.-S., Character impact odorants of Citrus Hallabong [(C. unshiu Marcov × C. sinensis Osbeck) × C. reticulata Blanco] cold-pressed peel oil, J. Agric. Food Chem., 2003, 51, 9, 2687-2692, https://doi.org/10.1021/jf021069o . [all data]

Chyau, Ko, et al., 2003
Chyau, C.-C.; Ko, P.-T.; Chang, C.-H.; Mau, J.-L., Free and glycosidically bound aroma compounds in lychee (Litchi chinensis Sonn.), Food Chem., 2003, 80, 3, 387-392, https://doi.org/10.1016/S0308-8146(02)00278-9 . [all data]

Choi, Kim. M.-S.L., et al., 2002
Choi, H.-S.; Kim. M.-S.L.; Sawamura, M., Constituents of the essential oil of cnidium officinale Makino, a Korean medicinal plant, Flavour Fragr. J., 2002, 17, 1, 49-53, https://doi.org/10.1002/ffj.1038 . [all data]

Claudela, Dirningera, et al., 2002
Claudela, P.; Dirningera, N.; Etievant, P., Effects of water on gas chromatographic column efficiency measurements applied to on-column injections of volatile aroma compounds, J. Sep. Sci., 2002, 25, 5-6, 365-370, https://doi.org/10.1002/1615-9314(20020401)25:5/6<365::AID-JSSC365>3.0.CO;2-Y . [all data]

Pet'ka, Mocák, et al., 2001
Pet'ka, J.; Mocák, J.; Farkas, P.; Balla, B.; Kovác, M., Classification of Slovak varietal white wines by volatile compounds, J. Sci. Food Agric., 2001, 81, 15, 1533-1539, https://doi.org/10.1002/jsfa.979 . [all data]

Wirth, Guo, et al., 2001
Wirth, J.; Guo, W.; Baumes, R.; Günata, Z., Volatile compounds released by enzymatic hydrolysis of glycoconjugates of leaves and grape berries from Vitis vinifera muscat of Alexandria and Shiraz cultivars, J. Agric. Food Chem., 2001, 49, 6, 2917-2923, https://doi.org/10.1021/jf001398l . [all data]

Brophy, Goldsack, et al., 2000
Brophy, J.J.; Goldsack, R.J.; Punruckvong, A.; Bean, A.R.; Forster, P.I.; Lepschi, B.J.; Doran, J.C.; Rozefelds, A.C., Leaf essential oils of the genus Leptospermum (Myrtaceae) in eastern Australia. Part 7. Leptospermum petersonii, L. liversidgei and allies, Flavour Fragr. J., 2000, 15, 5, 342-351, https://doi.org/10.1002/1099-1026(200009/10)15:5<342::AID-FFJ924>3.0.CO;2-V . [all data]

Bureau, Razungles, et al., 2000
Bureau, S.M.; Razungles, A.R.; Baumes, R.L., The aroma of Muscat of Frontignan grapes: effect of the light environment of vine or bunch on volatiles and glycoconjugates, J. Sci. Food Agric., 2000, 80, 14, 2012-2020, https://doi.org/10.1002/1097-0010(200011)80:14<2012::AID-JSFA738>3.0.CO;2-X . [all data]

Choi and Sawamura, 2000
Choi, H.-S.; Sawamura, M., Composition of the essential oil of Citrus tamurana Hort. ex Tanaka (Hyuganatsu), J. Agric. Food Chem., 2000, 48, 10, 4868-4873, https://doi.org/10.1021/jf000651e . [all data]

Brophy, Goldsack, et al., 1999
Brophy, J.J.; Goldsack, R.J.; Bean, A.R.; Forster, P.I.; Lepschi, B.J., Leaf essential oils of the genus Leptospermum (Myrtaceae) in eastern Australia. Part 5. Leptospermum continentale and allies, Flavour Fragr. J., 1999, 14, 2, 98-104, https://doi.org/10.1002/(SICI)1099-1026(199903/04)14:2<98::AID-FFJ797>3.0.CO;2-V . [all data]

Brophy, Forster, et al., 1998
Brophy, J.J.; Forster, P.I.; Goldsack, R.J., The essential oils of three unusual Eucalypts: Eucalyptus curtisii, E. rubiginosa and E. tenuipes (Myrtaceae), Flavour Fragr. J., 1998, 13, 2, 87-89, https://doi.org/10.1002/(SICI)1099-1026(199803/04)13:2<87::AID-FFJ699>3.0.CO;2-Y . [all data]

Cha, Kim, et al., 1998
Cha, Y.J.; Kim, H.; Cadwallader, K.R., Aroma-active compounds in Kimchi during fermentation, J. Agric. Food Chem., 1998, 46, 5, 1944-1953, https://doi.org/10.1021/jf9706991 . [all data]

Möllenbeck, König, et al., 1997
Möllenbeck, S.; König, T.; Schreier, P.; Schwab, W.; Rajaonarivony, J.; Ranarivelo, L., Chemical composition and analyses of enantiomers of essential oils from Madagascar, Flavour Fragr. J., 1997, 12, 2, 63-69, https://doi.org/10.1002/(SICI)1099-1026(199703)12:2<63::AID-FFJ614>3.0.CO;2-Z . [all data]

Humpf and Schreier, 1991
Humpf, H.-U.; Schreier, P., Bound aroma compounds from the fruit and the leaves of blackberry (Rubus laciniata L.), J. Agric. Food Chem., 1991, 39, 10, 1830-1832, https://doi.org/10.1021/jf00010a028 . [all data]

Frohlich and Schreier, 1990
Frohlich, O.; Schreier, P., Volatile Constituents of Loquat (Eriobotrya japonica Lindl.) Fruit, J. Food Sci., 1990, 55, 1, 176-180, https://doi.org/10.1111/j.1365-2621.1990.tb06046.x . [all data]

Le Quere and Latrasse, 1990
Le Quere, J.-L.; Latrasse, A., Composition of the Essential Oils of Blackcurrant Buds (Ribes nigrum L.), J. Agric. Food Chem., 1990, 38, 1, 3-10, https://doi.org/10.1021/jf00091a001 . [all data]

Fröhlich, Duque, et al., 1989
Fröhlich, O.; Duque, C.; Schreier, P., Volatile constituents of curuba (Passiflora mollissima) fruit, J. Agric. Food Chem., 1989, 37, 2, 421-425, https://doi.org/10.1021/jf00086a033 . [all data]

Chen and Ho, 1988
Chen, C.-C.; Ho, C.-T., Gas chromatographic analysis of volatile components of ginger oil (Zingiber officinale Roscoe) extracted with liquid carbon dioxide, J. Agric. Food Chem., 1988, 36, 2, 322-328, https://doi.org/10.1021/jf00080a020 . [all data]

Selli, Canbas, et al., 2006
Selli, S.; Canbas, A.; Cabaroglu, T.; Erten, H.; Gunata, Z., Aroma components of cv. Muscat of Bornova wines and influence of skin contact treatment, Food Chem., 2006, 94, 3, 319-326, https://doi.org/10.1016/j.foodchem.2004.11.019 . [all data]

Aubert, Baumann, et al., 2005
Aubert, C.; Baumann, S.; Arguel, H., Optimization of the Analysis of Flavor Volatile Compounds by Liquid-Liquid Microextraction (LLME). Application to the Aroma Analysis of Melons, Peaches, Grapes, Strawberries, and Tomatoes, J. Agric. Food Chem., 2005, 53, 23, 8881-8895, https://doi.org/10.1021/jf0510541 . [all data]

Elston, Lin, et al., 2005
Elston, A.; Lin, J.; Rouseff, R., Determination of the role of valencene in orange oil as a direct contributor to aroma quality, Flavour Fragr. J., 2005, 20, 4, 381-386, https://doi.org/10.1002/ffj.1578 . [all data]

Howard, Mike, et al., 2005
Howard, K.L.; Mike, J.H.; Riesen, R., Validation of a Solid-Phase Microextraction Method for Headspace Analysis of Wine Aroma Components, Am. J. Enol. Vitic, 2005, 56, 1, 37-45. [all data]

Ferrari, Lablanquie, et al., 2004
Ferrari, G.; Lablanquie, O.; Cantagrel, R.; Ledauphin, J.; Payot, T.; Fournier, N.; Guichard, E., Determination of key odorant compounds in freshly distilled cognac using GC-O, GC-MS, and sensory evaluation, J. Agric. Food Chem., 2004, 52, 18, 5670-5676, https://doi.org/10.1021/jf049512d . [all data]

Selli, Cabaroglu, et al., 2004
Selli, S.; Cabaroglu, T.; Canbas, A.; Erten, H.; Nurgel, C.; Lepoutre, J.P.; Gunata, Z., Volatile composition of red wine from cv. Kalecik Karasi grown in central Anatolia, Food Chem., 2004, 85, 2, 207-213, https://doi.org/10.1016/j.foodchem.2003.06.008 . [all data]

da Porto, Pizzale, et al., 2003
da Porto, C.; Pizzale, L.; Bravin, M.; Conte, L.S., Analyses of orange spirit flavour by direct-injection gas chromatography-mass spectrometry and headspace solid-phase microextraction/GC-MC, Flavour Fragr. J., 2003, 18, 1, 66-72, https://doi.org/10.1002/ffj.1164 . [all data]

Bertuzzi, Tirillini, et al., 2013
Bertuzzi, G.; Tirillini, B.; Angelini, P.; Venanzoni, R., Antioxidative action of Citrus limonum essential oil on scin, Eur. J. Medicinal Plants, 2013, 3, 1, 1-9, https://doi.org/10.9734/EJMP/2013/1987 . [all data]

Pinheiro, de Queiros, et al., 2013
Pinheiro, P.F.; de Queiros, V.T.; Rondelli, V.M.; Costa, A.V.; MArcelino, T. deP.; Pratissoli, D., Insecticidal activity of citronells grass essential oil on Frankliniella schultzei and Myzus persicae, Cienc. Agrotec. Lavras, 2013, 37, 2, 138-144, https://doi.org/10.1590/S1413-70542013000200004 . [all data]

Bendiabdellah, El Amine Dib, et al., 2012
Bendiabdellah, A.; El Amine Dib, M.; Djabou, N.; Allali, H.; Tabti, B.; Costa, J.; Myseli, A., Biological activities and volatile cinstituents of Daucus muricatus L. from Algeria, Chem. Centr. J., 2012, 6, 48, 1-22. [all data]

Boukhris, Bouaziz, et al., 2012
Boukhris, M.; Bouaziz, M.; Feki, I.; Jemai, H.; El Feki, A.; Sayadi, S., Hypoglycemic and antioxidant effects of leaf essential oil of Pelargonium graveolens L'Her. in alloxan induced diabetic rats, Lipids in Health and Disease, 2012, 11, 1, 1-10, https://doi.org/10.1186/1476-511X-11-81 . [all data]

Ameen, Usman, et al., 2011
Ameen, O.M.; Usman, L.A.; Oganija, F.S.; Hamid, A.A.; Muhammed, N.O.; Zubair, M.F.; Adebayo, S.A., Chemical composition of leaf essential oil of Annona senegalensis Pers. (Annonaceae) growing in North Central Nigeria, Int. J. Biol. Chem. Sci., 2011, 5, 1, 375-379. [all data]

Zarai, Kadri, et al., 2011
Zarai, Z.; Kadri, A.; Ben Chobba, I.; Ben Mansour, R.; Bekir, R.; Mejdoub, H.; Gharsallah, N., The in-vitro evaluation of antibacterial, antifungal and cytotoxic properties of Marrubium vulgare L. essential oil grown in Tunisia, Lipids in Health and Disease, 2011, 10, 161, 1-8. [all data]

Chalchat, Figueredo, et al., 2010
Chalchat, J.-C.; Figueredo, G.; Ozcan, M.M.; Unver, A., Effect of hydrodistillation and microwave distillation extraction methods on chemical composition of essential oil of pickling herb and myrtle plants, South Western J. of Agriculture, 2010, 1, 2, 133-141. [all data]

Mishra, Chaudhary, et al., 2010
Mishra, R.K.; Chaudhary, S.; Pandey, R.; Gupta, S.; Mallavarapu, G.R.; Kumar, S., Analysis of linalool content in the inflorescence (flower) essential oil and leaf oil of Lippia alba cultivar Kavach, J. Essen. Oil Res., 2010, 22, 1, 3-7, https://doi.org/10.1080/10412905.2010.9700253 . [all data]

Safaei-Ghomi, Meshkatalsadat, et al., 2010
Safaei-Ghomi, J.; Meshkatalsadat, M.H.; Asadi, M., Analysis of the essential oil of Salvia brachycalyx Boiss. by nano scale injection and antioxidative activity of methanol extract of this plant, Digest J. Nanomaterials and Biostructures, 2010, 5, 2, 545-549. [all data]

Gardini, Beletti, et al., 2009
Gardini, F.; Beletti, N.; Ndagikimana, M.; Guerzoni, M.E.; Tchoumbougnang, F.; Zollo, P.H.A.; Micci, C.; Lanciotti, R.; Kamdem, S.L.S., Composition of four essential oils obtained from plants from Cameroon, and their bactericidal and bacteriostatic activity against Listeria Monocytogenes, Salmonella enteritidis and Staphyllococcus aureus, African J. Microbiol. Res., 2009, 3, 5, 264-271. [all data]

Kazemi and Akhavani, 2009
Kazemi, M.; Akhavani, S., Constituents of Artemisia tournefortiana Rchb. essential oil from Iran, J. Appl. Chem. Res., 2009, 3, 10, 1-5. [all data]

Koba, Sanda, et al., 2009
Koba, K.; Sanda, K.; Guyon, C.; Raynaud, C.; Chaumont, J.-P.; Nicod, L., In vitro cytotoxic activity of Cymbopogon citratus L. and Cymbopogon nardus L. essential oils from Togo, J. Bangladesh Pharmacological Soc., 2009, 4, 29-34. [all data]

Seo, Kim, et al., 2009
Seo, S.-M.; Kim, J.; Lee, S.-G.; Shin, C.-H.; Shin, S.-C.; Park, I.-K., Fumigant antitermitic activity of plant essential oils and components from Aiowan (Trachyspermum ammi), Allspice (Pimenta dioica), Caraway (Carum carvi), Dill (Anethum graveolens), Geranium (Pelargonium graveolens), and Litsea (Litsea cubeba( oils against Japanese termite (Reticulitermes speratus Kolbe), J. Agric. Food Chem., 2009, 57, 15, 6596-6602. [all data]

Bieri and Marriott, 2008
Bieri, S.; Marriott, P.J., Dual-injection system with multiply injections for determining sidimentional retention indexes in comprehensive two-dimensional gas chromatography, Anal. Chem., 2008, 80, 3, 760-768, https://doi.org/10.1021/ac071367q . [all data]

Lo Presti, Sciarrone, et al., 2008
Lo Presti, M.; Sciarrone, D.; Crupi, M.C.; Costa, R.; Ragusa, S.; Dugo, G.; Mondello, L., Evaliation of the volatile and chiral composition in Pistacia lentiscus L. essential oil, Flavour Fragr. J., 2008, 23, 4, 249-257, https://doi.org/10.1002/ffj.1878 . [all data]

Mondello, Casilli, et al., 2008
Mondello, L.; Casilli, A.; Tranchida, Q.; Sciarrone, D.; Dugo, P.; Dugo, G., Analysis of allergens in fragrances using multiple heart-cut multidimentional gas chromatography - mass spectrometry, LC-GC Europe, 2008, 21, 130. [all data]

Saeidnia and Hadjiakhoondi, 2008
Saeidnia, S. Gohari; Hadjiakhoondi, A., Trypanocidal activity of the young leaves of Nepeta cataria L. obtained by solvent extraction, J. of Medicinal Plants, 2008, 7, Suppl. # 4, 54-57. [all data]

Wang, Yi, et al., 2008
Wang, Y.; Yi, L.; Liang, Y.; Li, H.; Yuan, D.; Gao, H.; Zeng, M., Comparative analysis of essential oil components in Pericarpium Citri Reticulatae Viride and Pericarpium Citri Reticulatae by GC-MS combined with chemometric resolution method, J. Pharmaceutical and Biomedical Anal., 2008, 46, 1, 66-74, https://doi.org/10.1016/j.jpba.2007.08.030 . [all data]

Adams, Beauchamp, et al., 2007
Adams, R.P.; Beauchamp, P.S.; Dev, V.; Dutz, S.M., New Natural Products Isolated from One-Seeded Juniperus of the Southwestern United States: Isolation and Occurence of 2-Ethenyl-3-methyl Phanol and Its Derivatives, J. Essent. Oil Res., 2007, 19, 2, 146-152, https://doi.org/10.1080/10412905.2007.9699247 . [all data]

Cheraif, Ben Jannet, et al., 2007
Cheraif, I.; Ben Jannet, H.; Hammami, M.; Khouja, M.L.; Mighri, Z., Chemical composition and antimicrobial activity of essential oils of Cupressus arizonica Greene, Biochem. Syst. Ecol., 2007, 35, 12, 813-820, https://doi.org/10.1016/j.bse.2007.05.009 . [all data]

El-Ghorab A., El-Massry K.F., et al., 2007
El-Ghorab A.; El-Massry K.F.; Shibamoto T., Chemical composition of the volatile extract and antioxidant activities of the volatile and nonvolatile extracts of Egyptian corn silk (Zea mays L.), J. Agric. Food Chem., 2007, 55, 22, 9124-9127, https://doi.org/10.1021/jf071646e . [all data]

Ferhat, Tigrine-Kordjani, et al., 2007
Ferhat, M.A.; Tigrine-Kordjani, N.; Chemat, S.; Meklati, B.Y.; Chemat, F., Rapid Extraction of Volatile Compounds Using a New Simultaneous Microwave Distillation: Solvent Extraction Device, Chromatographia, 2007, 65, 3-4, 217-222, https://doi.org/10.1365/s10337-006-0130-5 . [all data]

Loghmani-Khouzani, Fini, et al., 2007
Loghmani-Khouzani, H.; Fini, O.; Safari, J., Essential oil composition of Rosa damascena mill cultivated in Central Iran, Scientia Iranica, 2007, 14, 4, 316-319. [all data]

Loizzo, Tundis, et al., 2007
Loizzo, M.R.; Tundis, R.; Conforti, F.; Saab, A.M.; Statti, G.A.; Menichini, F., Comparative chemical composition, antioxidant and hypoglycaemic activities of Juniperus oxycedrus ssp. oxycedrus L. berry and wood oils from Lebanon, Food Chem., 2007, 105, 2, 572-578, https://doi.org/10.1016/j.foodchem.2007.04.015 . [all data]

Sylvestre, Pichette, et al., 2007
Sylvestre, M.; Pichette, A.; Longtin, A.; Martin, M.-A.C.; Bercion, S.R.; Legault, J., Chemical composition of leaf essential oil of Hedyosmum arborescens and evaluation of its anticancer activity, Natural Product Communications, 2007, 2, 12, 1269-1272. [all data]

Vichi, Riu-Aumatell, et al., 2007
Vichi, S.; Riu-Aumatell, M.; Mora-Pons, M.; Guadayol, J.M.; Buxaderas, S.; López-Tamames, E., Analytical, Nutritional and Clinical Methods. HS-SPME coupled to GC/MS for quality control of Juniperus communis L. berries used for gin aromatization, Food Chem., 2007, 105, 4, 1748-1754, https://doi.org/10.1016/j.foodchem.2007.03.026 . [all data]

Wenguang, Wenlai, et al., 2007
Wenguang, J.; Wenlai, F.; Yan, X.; Guangao, Z.; Jiming, L.; Ying, Y., Analysis of free terpenoids in four Vitis vinifera varietis using solvent assisted flavour evaporation and gas chromatography-tandem mass spectrometry, Chinese J. Chromatogr., 2007, 25, 6, 881-886, https://doi.org/10.1016/S1872-2059(08)60006-1 . [all data]

Boti, Yao, et al., 2006
Boti, J.B.; Yao, P.A.; Koukoua, G.; N'Guessan, T.Y.; Casanova, J., Components and chemical variability of Isolona campanulata Engler Diels leaf oil, Flavour Fragr. J., 2006, 21, 1, 166-170, https://doi.org/10.1002/ffj.1555 . [all data]

Cavaleiro, Pinto, et al., 2006
Cavaleiro, C.; Pinto, E.; Gonsales, M.J.; Salguero, L., Antifungal activity of Juniperus essential oils agains dermatophyte, Asrgillus and Candida strains, J. Appl. Microbiol., 2006, 100, 6, 1333-1338, https://doi.org/10.1111/j.1365-2672.2006.02862.x . [all data]

Fanciullino, Tomi, et al., 2006
Fanciullino, A.-L.; Tomi, F.; Luro, F.; Desjobert, J.M.; Casanova, J., Chemical variability of peel and leaf oils of mandarins, Flavour Fragr. J., 2006, 21, 2, 359-367, https://doi.org/10.1002/ffj.1658 . [all data]

Jirovetz, Eller, et al., 2006
Jirovetz, L.; Eller, G.; Buchbauer, G.; Schmidt, E.; Denkova, Z.; Stoyanova, A.S.; Nikolova R.; Geissler, M., Chemical composition, antimicrobial activities and odor descriptions of some essential oils with characteristic floral-rosy scent and of their principal aroma compounds, Recent. Res. Devel. Agronomy Horticulture, 2006, 2, 1-12. [all data]

Lan Phi N.T., Nishiyama C., et al., 2006
Lan Phi N.T.; Nishiyama C.; Choi H.-S.; Sawamura M., Evaluation of aroma characteristic compounds of Citrus natsudaidai Hayata (Natsudaidai) cold-pressed peel oil, Biosci. Biotechnol. Biochem., 2006, 70, 8, 1832-1838, https://doi.org/10.1271/bbb.50705 . [all data]

Lis and Milczarek, 2006
Lis, A.; Milczarek, J., Chemical composition of the essential oils from fruits, leaves and flowers of Phellodendron sachalinense (Fr. Schmidt) Sarg., Flavour Fragr. J., 2006, 21, 4, 683-686, https://doi.org/10.1002/ffj.1662 . [all data]

Orav, Raal, et al., 2006
Orav, A.; Raal, A.; Arak, E.; Müürisepp, M.; Kailas, T., Composition of the essential oil of Artemisia absinthium L. of different geographical origin, Proc. Est. Acad. Sci. Chem., 2006, 55, 3, 155-165. [all data]

Ouamba, Ouabonzi, et al., 2006
Ouamba, J.-M.; Ouabonzi, A.; Ekouya, A.; Bessière, J.-M.; Menut, C.; Abena, A.A.; Banzouzi, J.-T., Volatile constituents of the essential oil leaf of Lantana salvifolia Jacq. (Verbenaceae), Flavour Fragr. J., 2006, 21, 1, 158-161, https://doi.org/10.1002/ffj.1553 . [all data]

Ozel, Gogus, et al., 2006
Ozel, M.Z.; Gogus, F.; Lewis, A.C., Comparison of direct thermal desorption with water distillation and superheated water extraction for the analysis of volatile components of Rosa damascena Mill. using GCxGC-TOF/MS, Anal. Chim. Acta., 2006, 566, 2, 172-177, https://doi.org/10.1016/j.aca.2006.03.014 . [all data]

Pandey-Rai S., Mallavarapu G.R., et al., 2006
Pandey-Rai S.; Mallavarapu G.R.; Naqvi A.A.; Yadav A.; Rai S.K.; Srivastava S.; Singh D.; Mishra R.; Kumar S., Volatile components of leaves and flowers of periwinkle Catharanthus roseus (L.) G. Don from New Delhi, Flavour Fragr. J., 2006, 21, 3, 427-430, https://doi.org/10.1002/ffj.1606 . [all data]

Robinson, 2006
Robinson, C.J., A new essential oil - Agonis fragrans, A report for the Rural Industries Research and Development Corporation, RIRDC Publication No. 06/090, Rural Industries Research and Development Corporation, Barton, ACT, 2006, 12. [all data]

Setzer, Noletto, et al., 2006
Setzer, W.N.; Noletto, J.A.; Lawton, R.O., Chemical composition of the floral essential oil of Randia matudae from Monteverde, Costa Rica, Flavour Fragr. J., 2006, 21, 2, 244-246, https://doi.org/10.1002/ffj.1567 . [all data]

Wang, Yang, et al., 2006
Wang, Q.; Yang, Y.; Zhao, X.; Zhu, B.; Nan, P.; Zhao, J.; Wang, L.; Chen, F.; Liu, Z.; Zhong, Y., Chemical variation in the essential oil of Ephedra sinica from Northeastern China, Food Chem., 2006, 98, 1, 52-58, https://doi.org/10.1016/j.foodchem.2005.04.033 . [all data]

Wohlmuth, Smith, et al., 2006
Wohlmuth, H.; Smith, M.K.; Brooks, L.O.; Myers, S.P.; Leach, D.N., Essential oil composition of diploid and tetraploid clones of ginger (Zingiber officinale Roscoe) grown in Australia, J. Agric. Food Chem., 2006, 54, 4, 1414-1419, https://doi.org/10.1021/jf0521799 . [all data]

Chagonda and Chalchat, 2005
Chagonda, L.S.; Chalchat, J.-C., The essential oil of wild and cultivated Hoslundia opposita Vahl. from Zimbabwe, Flavour Fragr. J., 2005, 20, 2, 193-195, https://doi.org/10.1002/ffj.1402 . [all data]

Chalchat and Özcan, 2005
Chalchat, J.-C.; Özcan, M., Constituents of the essential oil of Sideritis erythantha Boiss. Heldr. Var. erythrantha, Gen. Appl. Plant Physiology, 2005, 31, 1-2, 65-70. [all data]

Duarte, Figueira, et al., 2005
Duarte, M.C.T.; Figueira, G.M.; Sartoratto, A.; Rehder, V.L.G.; Delarmelina, C., Anti-Candida activity of Brazilian medicinal plants, J. Ethnopharmacol., 2005, 97, 2, 305-311, https://doi.org/10.1016/j.jep.2004.11.016 . [all data]

Ghasemi Y., Faridi P., et al., 2005
Ghasemi Y.; Faridi P.; Mehregan I.; Mohagheghzadeh A., Ferula gummosa fruits: An aromatic antimicrobial agent, Chem. Nat. Compd. (Engl. Transl.), 2005, 41, 3, 311-314, https://doi.org/10.1007/s10600-005-0138-3 . [all data]

Jirovetz, Buchbauer, et al., 2005
Jirovetz, L.; Buchbauer, G.; Stoyanova, A.; Georgiev, E.V.; Damianova, S.T., Composition, quality control and antimicrobial activity of the essential oil of cumin (Cuminum cyminumL.) seeds from Bulgaria that had been stored for up to 36 years, Int. J. Food Sci. Technol., 2005, 40, 3, 305-310, https://doi.org/10.1111/j.1365-2621.2004.00915.x . [all data]

Pellati, Benvenuti, et al., 2005
Pellati, F.; Benvenuti, S.; Yoshizaki, F.; Bertelli, D.; Rossi, M.C., Headspace solid-phase microextraction-gas chromatography-mass spectrometry analysis of the volatile compounds of Evodia species fruits, J. Chromatogr. A, 2005, 1087, 1-2, 265-273, https://doi.org/10.1016/j.chroma.2005.01.060 . [all data]

Setzer, Noletto, et al., 2005
Setzer, W.N.; Noletto, J.A.; Lawton, R.O.; Haber, W.A., Leaf essential oil composition of five Zanthoxylum species from Monteverde, Costa Rica, Molecular Diversity, 2005, 9, 1-3, 3-13, https://doi.org/10.1007/s11030-005-1298-6 . [all data]

Shams-Ardakani, Ghannadi, et al., 2005
Shams-Ardakani, M.; Ghannadi, A.; Badr, P.; Mohagheghzadeh, A., Biotransformation of terpenes and related compounds by suspension culture of Glycyrrhiza glabra L. (Papilionaceae), Flavour Fragr. J., 2005, 20, 2, 141-144, https://doi.org/10.1002/ffj.1401 . [all data]

Singh, Raina, et al., 2005
Singh, A.K.; Raina, V.K.; Naqvi, A.A.; Patra, N.K.; Kumar, B.; Ram, P.; Khanuja, S.P.S., Essential oil composition and chemoarrays of menthol mint (Mentha arvensis L. f. piperascens Malinvaud ex. Holmes) cultivars, Flavour Fragr. J., 2005, 20, 3, 302-305, https://doi.org/10.1002/ffj.1417 . [all data]

Tepe B., Sokmen M., et al., 2005
Tepe B.; Sokmen M.; Akpulat H.A.; Daferera D.; Polissiou M.; Sokmen A., Antioxidative activity of the essential oils of Thymus sipyleus subsp sipyleus var. sipyleus and Thymus sipyleus subsp sipyleus var. rosulans, J. Food Eng., 2005, 66, 4, 447-454, https://doi.org/10.1016/j.jfoodeng.2004.04.015 . [all data]

Tesevic, Nikicevic, et al., 2005
Tesevic, V.; Nikicevic, N.; Jovanovic, A.; Djokovic, D.; Vujisic, L.; Vuckovic, I.; Bonic, M., Volatile components from old plum brandies, Food Technol. Biotechnol., 2005, 43, 4, 367-372. [all data]

Vichi, Riu-Aumatell, et al., 2005
Vichi, S.; Riu-Aumatell, M.; Mora-Pons, M.; Buxaderas, S.; Lopez-Tamames, E., Characterization of Volatiles in Different Dry Gins, J. Agric. Food Chem., 2005, 53, 26, 10154-10160, https://doi.org/10.1021/jf058121b . [all data]

Agnihotri, Thappa, et al., 2004
Agnihotri, V.K.; Thappa, R.K.; Meena, B.; Kapahi, B.K.; Saxena, R.K.; Qazi, G.N.; Agarwal, S.G., Essential oil composition of aerial parts of Angelica glauca growing wild in North-West Himalaya (India), Phytochemistry, 2004, 65, 16, 2411-2413, https://doi.org/10.1016/j.phytochem.2004.07.004 . [all data]

Choi, 2004
Choi, H.-S., Volatile constituents of satsuma mandarins growing in Korea, Flavour Fragr. J., 2004, 19, 5, 406-412, https://doi.org/10.1002/ffj.1283 . [all data]

Lis, Boczek, et al., 2004
Lis, A.; Boczek, E.; Góra, J., Chemical composition of the essential oils from fruits, leaves and flowers of the Amur cork tree (Phellodendron amurense Rupr.), Flavour Fragr. J., 2004, 19, 6, 549-553, https://doi.org/10.1002/ffj.1349 . [all data]

Mimica-Dukic, Bozin, et al., 2004
Mimica-Dukic, N.; Bozin, B.; Sokovic, M.; Simin, N., Antimicrobial and antioxidant activities of Melissa officinalis L. (Lamiaceae) essential oil, J. Agric. Food Chem., 2004, 52, 9, 2485-2489, https://doi.org/10.1021/jf030698a . [all data]

Palá-Paúl, García-Jiménez, et al., 2004
Palá-Paúl, J.; García-Jiménez, R.; Pérez-Alonso, M.J.; Velasco-Negueruela, A.; Sanz, J., Essential oil composition of the leaves and stems of Meum athamanticum Jacq., from Spain, J. Chromatogr. A, 2004, 1036, 2, 245-247, https://doi.org/10.1016/j.chroma.2004.02.064 . [all data]

Raal, Arak, et al., 2004
Raal, A.; Arak, E.; Orav, A., Chemical composition of coriander seed essential oil and their conformity with EP standards, Agraarteadus, 2004, 15, 4, 234-239. [all data]

Sawamura, Son, et al., 2004
Sawamura, M.; Son, U.-S.; Choi, H.-S.; Kim, M.-S.L.; Phi, N.T.L.; Fears, M.; Kumagai, Compositional changes in commercial lemon essential oil for aromatherapy, Int. J. Aromatherapy, 2004, 14, 1, 27-36, https://doi.org/10.1016/j.ijat.2004.02.001 . [all data]

Sawamura, Sou, et al., 2004
Sawamura, M.; Sou, U.-S.; Choi, H.-S.; Kim, M.-S.; Phi, N.T.L.; Fears, M.; Kumagai. C., Composition changes in commercial lemon essential oil for aromatherapy, Int. J. Aromatherapy, 2004, 14, 1, 27-36, https://doi.org/10.1016/j.ijat.2004.02.001 . [all data]

Choi, 2003, 2
Choi, H.-S., Characterization of citrus unshiu (C. unshiu Marcov. forma Miyagawa-wase) blossom aroma by solid-phase microextraction in conjunction with an electronic nose, J. Agric. Food Chem., 2003, 51, 2, 418-423, https://doi.org/10.1021/jf0114280 . [all data]

Jirovetz, Buchbauer, et al., 2003
Jirovetz, L.; Buchbauer, G.; Stoyanova, A.S.; Georgiev, E.V.; Damianova, S.T., Composition, quality control, and antimicrobial activity of the essential oil of long-time stored dill (Anethum graveolens L.) seeds from Bulgaria, J. Agric. Food Chem., 2003, 51, 13, 3854-3857, https://doi.org/10.1021/jf030004y . [all data]

Mookdasanit, Tamura, et al., 2003
Mookdasanit, J.; Tamura, H.; Yoshizawa T.; Tokunaga T.; Nakanishi, K., Trace Volatile Compounds in Essential Oil of Citrus Sudachi by Means of Modified Solvent Extraction Method, Food Sci Technol. Res., 2003, 9, 1, 54-61, https://doi.org/10.3136/fstr.9.54 . [all data]

Nakahara, Alzoreky, et al., 2003
Nakahara, K.; Alzoreky, N.S.; Yoshihashi, T.; Nguyen, H.T.T.; Trakoontivakorn, G., Chemical composition and antifungal activity of essential oil from Cymbopogon nardus (citronella grass), Japan Agricultural Research Quarterly, 2003, 37, 4, 249-252, https://doi.org/10.6090/jarq.37.249 . [all data]

Cimanga, Apers, et al., 2002
Cimanga, K.; Apers, S.; de Bruyne, T.; van Miert, S.; Hermans, N.; Totté, J.; Pieters, L.; Vlietinck, A.J., Chemical composition and antifungal activity of essential oils of some aromatic medicinal plants growing in the democratic republic of Congo, J. Essent. Oil Res., 2002, 14, 5, 382-387, https://doi.org/10.1080/10412905.2002.9699894 . [all data]

Gancel, Ollé, et al., 2002
Gancel, A.-L.; Ollé, D.; Ollitrault, P.; Luro, F.; Brillouet, J.-M., Leaf and peel volatile compounds of an interspecific citrus somatic hybrid [Citrus aurantifolia (Christm.) Swing. + Citrus paradisi Macfayden], Flavour Fragr. J., 2002, 17, 6, 416-424, https://doi.org/10.1002/ffj.1119 . [all data]

Ghannadi, Sajjadi, et al., 2002
Ghannadi, A.; Sajjadi, S.E.; Beigihasan, A., Composition of the essential oil of Ferula ovina (Boiss.) Boiss. from Iran, DARU, 2002, 10, 4, 165-167, retrieved from http://www1.tums.ac.ir/daru/Daru4%202002/Ghannadi.PDF. [all data]

Jirovetz, Buchbauer, et al., 2002
Jirovetz, L.; Buchbauer, G.; Ngassoum, M.B.; Geissler, M., Aroma compound analysis of Piper nigrum and Piper guineense essential oils from Cameroon using solid-phase microextraction-gas chromatography, solid-phase microextraction-gas chromatography-mass spectrometry and olfactometry, J. Chromatogr. A, 2002, 976, 1-2, 265-275, https://doi.org/10.1016/S0021-9673(02)00376-X . [all data]

Jirovetz, Ngassoum, et al., 2002
Jirovetz, L.; Ngassoum, M.B.; Geissler, M., Analysis of the headspace aroma compounds of the seeds of the Cameroonian garlic plant Hua gabonii using SPME/GC/FID, SPME/GC/MS and olfactometry, Eur. Food Res. Technol., 2002, 214, 3, 212-215, https://doi.org/10.1007/s00217-001-0481-y . [all data]

Jirovetz, Smith, et al., 2002
Jirovetz, L.; Smith, D.; Buchbauer, G., Aroma compound analysis of Eruca sativa (Brassicaceae) SPME headspace leaf samples using GC, GC-MS, and olfactometry, J. Agric. Food Chem., 2002, 50, 16, 4643-4646, https://doi.org/10.1021/jf020129n . [all data]

Lockwood, Asghari, et al., 2002
Lockwood, G.B.; Asghari, G.; Hakimi, B., Production of essential oil constituents by cultured cells of Carum copticum L., Flavour Fragr. J., 2002, 17, 6, 456-458, https://doi.org/10.1002/ffj.1129 . [all data]

Doimo, 2001
Doimo, L., Iso-citrals and iso-geraniols in lemon-myrtle (Backhousia citriodora F. Muell.) essential oils, J. Essent. Oil Res., 2001, 13, 4, 236-237, https://doi.org/10.1080/10412905.2001.9699680 . [all data]

Gupta, Mallavarapu, et al., 2001
Gupta, R.; Mallavarapu, G.R.; Banerjee, S.; Kumar, S., Characteristics of an isomenthone-rich somaclonal mutant isolated in a geraniol-rich rose-scented geranium accession of Pelargonium graveolens, Flavour Fragr. J., 2001, 16, 5, 319-324, https://doi.org/10.1002/ffj.1002 . [all data]

Kamath, Asha, et al., 2001
Kamath, A.; Asha, M.R.; Ravi, R.; Narasimhan, S.; Rajalakshmi, D., Comparative study of odour and GC-olfactometric profiles of selected essential oils, Flavour Fragr. J., 2001, 16, 6, 401-407, https://doi.org/10.1002/ffj.1020 . [all data]

Lota, de Rocca Serra, et al., 2001
Lota, M.-L.; de Rocca Serra, D.; Tomi, F.; Casanova, J., Chemical variability of peel and leaf essential oils of 15 species of mandarins, Biochem. Syst. Ecol., 2001, 29, 1, 77-104, https://doi.org/10.1016/S0305-1978(00)00029-6 . [all data]

Yang, 2001
Yang, R., Volatile compounds in peel oil of Citrus sudachi, Food Sci. (Beijing), 2001, 22, 3, 71-73. [all data]

Kim, Kim, et al., 2000
Kim, H.-J.; Kim, K.; Kim, N.-S.; Lee, D.-S., Determination of floral fragrances of Rosa hybrida using solid-phase trapping-solvent extraction and gas chromatography-mass spectrometry, J. Chromatogr. A, 2000, 902, 2, 389-404, https://doi.org/10.1016/S0021-9673(00)00863-3 . [all data]

Mitiku, Sawamura, et al., 2000
Mitiku, S.B.; Sawamura, M.; Itoh, T.; Ukeda, H., Volatile components of peel cold-pressed oils of two cultivars of sweet orange (Citrus sinensis (L.) Osbeck) from Ethiopia, Flavour Fragr. J., 2000, 15, 4, 240-244, https://doi.org/10.1002/1099-1026(200007/08)15:4<240::AID-FFJ902>3.0.CO;2-F . [all data]

Oberhofer, Nikiforov, et al., 1999
Oberhofer, B.; Nikiforov, A.; Buchbauer, G.; Jirovetz, L.; Bicchi, C., Investigation of the alteration of the composition of various essential oils used in aroma lamp applications, Flavour Fragr. J., 1999, 14, 5, 293-299, https://doi.org/10.1002/(SICI)1099-1026(199909/10)14:5<293::AID-FFJ829>3.0.CO;2-T . [all data]

Ong and Acree, 1999
Ong, P.K.C.; Acree, T.E., Similarities in the aroma chemistry of Gewürztraminer variety wines and lychee (Litchi chinesis Sonn.) fruit, J. Agric. Food Chem., 1999, 47, 2, 665-670, https://doi.org/10.1021/jf980452j . [all data]

Tropnikova, Zenkevich, et al., 1999
Tropnikova, I.V.; Zenkevich, I.G.; Budantsev, A.L., Composition of Essential Oil Nepeta cataria L. var. Citriodora Beck and Features of its Determination, Rastit. Resursy (Rus.), 1999, 2, 64-69. [all data]

Zoghbi, Andrade, et al., 1999
Zoghbi, M.G.B.; Andrade, E.H.A.; Maia, J.G.S., The essential oil of Vitex angus-castus L. growing in the Amazon region, Flavour Fragr. J., 1999, 14, 4, 211-213, https://doi.org/10.1002/(SICI)1099-1026(199907/08)14:4<211::AID-FFJ812>3.0.CO;2-W . [all data]

Ferreira, Ardanuy, et al., 1998
Ferreira, V.; Ardanuy, M.; López, R.; Cacho, J.F., Relationship between flavor dilution values and odor unit values in hydroalcoholic solutions: role of volatility and a practical rule for its estimation, J. Agric. Food Chem., 1998, 46, 10, 4341-4346, https://doi.org/10.1021/jf980144l . [all data]

Ong and Acree, 1998
Ong, P.K.C.; Acree, T.E., Gas chromatography/olfactory analysis of lychee (Litchi chinesis Sonn.), J. Agric. Food Chem., 1998, 46, 6, 2282-2286, https://doi.org/10.1021/jf9801318 . [all data]

Rajeswara, Kaul, et al., 1996
Rajeswara, B.R.; Kaul, P.N.; Bhattacharya, A.K.; Mallavarapu, G.R.; Ramesh, S., Yield and chemical composition of the essential oils of three Cymbopogon species suffering from iron chlorosis, Flavour Fragr. J., 1996, 11, 5, 289-293, https://doi.org/10.1002/(SICI)1099-1026(199609)11:5<289::AID-FFJ590>3.0.CO;2-7 . [all data]

Sohounhloue, Dangou, et al., 1996
Sohounhloue, D.K.; Dangou, J.; Gnomhossou, B.; Garneau, F.-X.; Gagnon, H.; Jean, F.-I., Leaf oils of three Eucalyptus species from Benin: E. torelliana F. Muell., E. citriodora Hook. and E. tereticornis Smith, J. Essent. Oil Res., 1996, 8, 1, 111-113, https://doi.org/10.1080/10412905.1996.9700571 . [all data]

Tirado, Stashenko, et al., 1995
Tirado, C.B.; Stashenko, E.E.; Combariza, M.Y.; Martinez, J.R., Comparative study of Colombian citrus oils by high-resolution gas chromatography and gas chromatography-mass spectrometry, J. Chromatogr. A, 1995, 697, 1-2, 501-513, https://doi.org/10.1016/0021-9673(94)00955-9 . [all data]

Tamura, Yang, et al., 1993
Tamura, H.; Yang, R.-H.; Sugisawa, H., Aroma profiles of peel oils of acid citrus, ACS Sym. Ser., 1993, 525, 121-136. [all data]

Shiota, 1991
Shiota, H., Volatile components of pawpaw fruit (Asimina triloba Dunal.), J. Agric. Food Chem., 1991, 39, 9, 1631-1635, https://doi.org/10.1021/jf00009a019 . [all data]

Velasco-Negueruela, Pérez Alonso, et al., 1991
Velasco-Negueruela, A.; Pérez Alonso, M.J.; Burzaco, A., Aceites esenciales de tomillos ibéricos. VI. Contribución al conocimiento del aceite esencial de thymus capitellatus Hoffmanns. Link, Anales Jard. Bot. Madrid, 1991, 49, 1, 77-81. [all data]

Yang and Sugisawa, 1990
Yang, R.; Sugisawa, H., Citrus Suachi Hort. ex Shirai. Volatile components in Sudachi (Citrus Sudachi Hort. ex Shirai) juice, Nippon Shokuhin Kogyo Gakkaishi, 1990, 37, 12, 946-952, https://doi.org/10.3136/nskkk1962.37.12_946 . [all data]

Sugisawa, Yamamoto, et al., 1989
Sugisawa, H.; Yamamoto, M.; Tamura, H.; Takagi, N., The comparison of volatile components in peel oil from four species of navel orange, Nippon Shokuhin Kogio Gakkaishi, 1989, 36, 6, 455-462, https://doi.org/10.3136/nskkk1962.36.6_455 . [all data]

Sugisawa, Yang, et al., 1989
Sugisawa, H.; Yang, R.H.; Kawabata, C.; Tamura, H., Volatile constituents in the peel oil of sudachi (Citrus sudachi), Agric. Biol. Chem., 1989, 53, 6, 1721-1723, https://doi.org/10.1271/bbb1961.53.1721 . [all data]

Shibamoto and Jennings, 1977
Shibamoto, T.; Jennings, W.G., The volatile composition of the leaf oil of California Juniper (J. californica Carr.) in Proceedings of VII International Congress of Essential Oils, October 7-11, 1977, Kyoto, Japan, 1977, 413-418. [all data]

Collin, Nizet, et al., 2012
Collin, S.; Nizet, S.; Gros, J., Le houblonnage a cru des bieres speciales belges est bien plus qu'une simple dissolution des composes aromatiques du houblon (in Flamish), Cerevisia, 2012, 36, 4, 119-124, https://doi.org/10.1016/j.cervis.2011.12.001 . [all data]

Robinson, Adams, et al., 2012
Robinson, A.L.; Adams, D.O.; Boss, P.K.; Heymann, H.; Solomon, P.S.; Trengove, R.D., Influence of geographic origine on the sensory characteristics and wine composition of Vitus viniferas cv. Cabernet Sauvignon wines from Australia (Supplemental data), Am. J. Enol. Vitic., 2012, 64, 4, 467-476, https://doi.org/10.5344/ajev.2012.12023 . [all data]

VOC BinBase, 2012
VOC BinBase, The volatile compound BinBase (VOC BinBase), 2012, retrieved from http://fiehnlab.ucdavis.edu/projects/VocBinBase and http://binbase.sourceforge.net. [all data]

Gros, Nizet, et al., 2011
Gros, J.; Nizet, S.; Collin, S., Occurence of odorant polyfunctional thiols in the Super Alpha Tomahawk Hop cultivar. Comparison with the thiol-rich Nelson Sauvin bitter variety, J. Agric. Food Chem., 2011, 59, 16, 8853-8865, https://doi.org/10.1021/jf201294e . [all data]

Laribi, Kouki, et al., 2011
Laribi, B.; Kouki, K.; Sahli, A.; Mougou, A.; Marzouk, B., Essential oil fatty acids composition of a Tunisian caraway (Carum carvi L.) seed ecotype cultivated under water deficit, Adv. Environ. Biol., 2011, 1-15, retrieved from http://www.thefreelibrary.com//print/PrintArticle.aspx?id=253057768. [all data]

Miyazaki, Plotto, et al., 2011
Miyazaki, T.; Plotto, A.; Goodner, K.; Gmitter F.G., Distribution of aroma volatile compounds in tangerine hybrids and proposed inheritance, J. Sci. Food Agric., 2011, 91, 3, 449-460, https://doi.org/10.1002/jsfa.4205 . [all data]

Skogerson, Wohlgemuth, et al., 2011
Skogerson, K.; Wohlgemuth, G.; Fiehn, O., VocBinNase, 2011, retrieved from http://fiehnlab.ucdavis.edu/projects//VocBinBase. [all data]

Liu, Chu, et al., 2010
Liu, Z.L.; Chu, S.S.; Liu, Q.R., Chemical composition and insecticidial activity against Sitophilus zeamais of the essential oils of Artemisia capillaris and Artemisia mongolica, Molecules, 2010, 15, 4, 2600-2608, https://doi.org/10.3390/molecules15042600 . [all data]

San-Juan, Petka, et al., 2010
San-Juan, F.; Petka, J.; Cacho, J.; Ferreira, V.; Escudero, A., Producing headspace extracts for the gas chromatography - olphactometric evaluation of wine aroma, Food Chemistry, 2010, 123, 1, 188-195, https://doi.org/10.1016/j.foodchem.2010.03.129 . [all data]

Scandinaro, Tranchida, et al., 2010
Scandinaro, M.; Tranchida, P.Q.; Costa, R.; Dugo, P.; Mondello, L., Rapid Quality Control of Flavours and Fragrances using Fast GC-MS and Multi-MS Library Search Procedures, LCGC Europe, 2010, 23, 9, 456-464. [all data]

Custer, 2009
Custer, Y., GC Volatile Components Analysis of Different Parts of Litchi chinensis (Dissertation), 2009. [all data]

Delort and Jaquier, 2009
Delort, E.; Jaquier, A., Novel terpenyl esters from Australian finger lime (Citrus australasica) peel extract, Flav. Fragr. J., 2009, 24, 3, 123-132, https://doi.org/10.1002/ffj.1922 . [all data]

Dharmawan, Kasapis, et al., 2009
Dharmawan, J.; Kasapis, S.; Sriramula, P.; Lear, M.J.; Curran, P., Evaluation of aroma-active compounds in Pontianak orange peel oil (Citrus nobilis Lour. var. microcarpa Hassk.) by gas chromatography - olfactometry, aroma reconstitution, and omission test, J. Agric. Food Chem., 2009, 57, 1, 239-244, https://doi.org/10.1021/jf801070r . [all data]

Mendes, Trindade, et al., 2009
Mendes, M.D.; Trindade, H.; Figueiredo, A.C.; Barroso, J.G.; Fontinha, S.S.; Pedro, L.G., Volatile and molecular characterization of two Portuguese endemic species: Angelica lignescens and Melanoselinium decipiens, Biochen. Systematics Ecol., 2009, 37, 2, 98-105, https://doi.org/10.1016/j.bse.2008.12.006 . [all data]

Riahi, Pourbasheer, et al., 2009
Riahi, S.; Pourbasheer, E.; Ganjali, M.R.; Norouzi, P., Investigation of different linear and non-linear chemometric methods for modeling of retention index of essential oil components: Concerns to support vector mashine, J. Hazard. Mat., 2009, 166, 2-3, 853-859, https://doi.org/10.1016/j.jhazmat.2008.11.097 . [all data]

Yang, Yang, et al., 2009
Yang, Z.; Yang, W.; Peng, Q.; He, Q.; Feng, Y.; Luo, S.; Yu, Z., Volatile phytochemical composition of rhisome of ginger after extraction by headspace solid-phase microextraction, petrol ether extraction and steam distillation extraction, Bangladesh J. Pharmacol., 2009, 4, 2, 136-143, https://doi.org/10.3329/bjp.v4i2.3232 . [all data]

Zachariah, Leela, et al., 2008
Zachariah, T.J.; Leela, N.K.; Maya, K.M.; Rema, J.; Mathew, P.A.; Vipin, T.M.; Krishnamoorthy, B., Chemical composition of leaf oils of Myristica beddomeii (King), Myristica fragrans (Houtt.) and Myristica malabarica (Lamk.), J. Spices Arom. Crops, 2008, 17, 1, 10-15. [all data]

Ferreira, Meireles de Sousa, et al., 2007
Ferreira, N.J.; Meireles de Sousa, I.G.; Luís, T.C.; Currais, A.J.M.; Figueiredo, C.; Cost, M.M.; Lima, A.S.B.; Santos, P.A.G.; Barroso, J.G.; Pedro, L.G.; Scheffer, J.J.C., Pittosporum undulatum Vent. grown in Portugal: secretory structures, seasonal variation and enantiomeric composition of its essential oil, Flavour Fragr. J., 2007, 22, 1, 1-9, https://doi.org/10.1002/ffj.1748 . [all data]

Kamatou, Viljoen, et al., 2007
Kamatou, G.P.P.; Viljoen, A.M.; Figueiredo, A.C.; Tilney, P.M.; Van Zyl, R.L.; Barroso, J.G.; Pedro, L.G.; Van Vuuren, S.F., Trichomes, essential oil composition and biological activities of Salvia albanicus Benth. and S. dolomitica Codd, two species from the Cape region of Soith Africa, South African J. Botany, 2007, 73, 1, 102-108, https://doi.org/10.1016/j.sajb.2006.08.001 . [all data]

Nivinsliene, Butkiene, et al., 2007
Nivinsliene, O.; Butkiene, R.; Gudalevic, A.; Mockute, D.; Meskauskiene, V.; Grigaliunaite, B., Influence of urban environment on chemical composition of Tilia cordata essential oil, Chemija, 2007, 18, 1, 44-49. [all data]

Radusiene, Judzentiene, et al., 2007
Radusiene, J.; Judzentiene, A.; Peciulyte, D.; Janulis, V., Essential Oil Composition and Antimicrobial Assay of Acorus calamus Leaves from Different Wild Populations, Plant Genetic Resources: Characterization and Utilization, 2007, 5, 1, 37-44, https://doi.org/10.1017/S1479262107390928 . [all data]

Jordan, Martinez, et al., 2006
Jordan, M.J.; Martinez, R.M.; Goodner, K.L.; Baldwin, E.A.; Sotomayor, J.A., Seasonal variation of Thymus hyemalis Lange and Spanish Thymus vulgaris L. essential oils composition, Ind. Crops Prod., 2006, 24, 3, 253-263, https://doi.org/10.1016/j.indcrop.2006.06.011 . [all data]

Schmidt, Noletto, et al., 2006
Schmidt, J.M.; Noletto, J.A.; Vogler, B.; Setzer, W.N., Abaco Bush Medicine: Chemical composition of the essential oils of four aromatic medicinal plants from Abaco Island, Bahamas, J. Herbs, Spices Medicinal Plants, 2006, 12, 3, 43-65, https://doi.org/10.1300/J044v12n03_04 . [all data]

Singh G., Maurya S., et al., 2006
Singh G.; Maurya S.; de Lampasona M.P.; Catalan C.A.N., Studies on essential oils, Part 41. Chemical composition, antifungal, antioxidant and sprout suppressant activities of coriander (Coriandrum sativum) essential oil and its oleoresin, Flavour Fragr. J., 2006, 21, 3, 472-479, https://doi.org/10.1002/ffj.1608 . [all data]

Srivastava, Mallavarapu, et al., 2006
Srivastava, S.; Mallavarapu, G.R.; Rai, S.K.; Singh, D.; Mishra, R.; Pandey-Rai, S.; Kumar, S., Composition of the essential oils of the leaves and flowers of Rhus mysurensis Heyne ex Wight Arn growing in the Aravalli mountain range at New Delhi, Flavour Fragr. J., 2006, 21, 2, 228-229, https://doi.org/10.1002/ffj.1561 . [all data]

Tognolini, Barocelli, et al., 2006
Tognolini, M.; Barocelli, E.; Ballabeni, V.; Bruni, R.; Bianchi, A.; Chiavarini, M.; Impicciatore, M., Comparative screening of plant essential oils: Phenylpropanoid moiety as basic core for antiplatelet activity, Life Sciences, 2006, 78, 13, 1419-1432, https://doi.org/10.1016/j.lfs.2005.07.020 . [all data]

Butkienë, Nivinskienë, et al., 2005
Butkienë, R.; Nivinskienë, O.; Mockutë, D., α-Pinene chemotype of leaf (needle) essential oils of Juniperus communis L. growing wild in Vilnius district, Chemija, 2005, 16, 1, 53-60. [all data]

Singh, Maurya, et al., 2005
Singh, G.; Maurya, S.; Catalan, C.; de Lampasona, M.P., Studies on essential oils, Part 42: chemical, antifungal, antioxidant and sprout suppressant studies on ginger essential oil and its oleoresin, Flavour Fragr. J., 2005, 20, 1, 1-6, https://doi.org/10.1002/ffj.1373 . [all data]

Butkienë, Nivinskienë, et al., 2004
Butkienë, R.; Nivinskienë, O.; Mockutë, D., Chemical composition of unripe and ripe berry essential oils of Juniperus communis L. growing wild in Vilnius district, Chemija, 2004, 15, 4, 57-63. [all data]

Carpino, Mallia, et al., 2004
Carpino, S.; Mallia, S.; Licitra, G.; van Soest, P.J.; Acree, T.E., Aroma compounds of some Hyblean pasture species, Flavour Fragr. J., 2004, 19, 4, 293-297, https://doi.org/10.1002/ffj.1346 . [all data]

Carpino, Mallia, et al., 2004, 2
Carpino, S.; Mallia, S.; La Terra, S.; Melilli, C.; Licitra, G.; Acree, T.E.; Barbano, D.M.; van Soest, P.J., Composition and aroma compounds of ragusano cheese: native pasture and total mixed rations, J. Dairy Sci., 2004, 87, 4, 816-830, https://doi.org/10.3168/jds.S0022-0302(04)73226-9 . [all data]

Koba, Sanda, et al., 2004
Koba, K.; Sanda, K.; Raynaud, C.; Nenonene, Y.A.; Millet, J.; Chaumont, J.P., Activités antimicrobiennes d'huiles essentielles de trois Cymbopogon sp. africains vis-àvis de germes pathogènes d'animaux de compagnie, Ann. Med. Vet., 2004, 148, 202-206. [all data]

Sotomayor, Martínez, et al., 2004
Sotomayor, J.A.; Martínez, R.M.; García, A.J.; Jordán, M.J., Thymus zygis Subsp. Gracilis: watering level effect on phytomass production and essential oil quality, J. Agric. Food Chem., 2004, 52, 17, 5418-5424, https://doi.org/10.1021/jf0496245 . [all data]

Vinogradov, 2004
Vinogradov, B.A., Production, composition, properties and application of essential oils, 2004, retrieved from http://viness.narod.ru. [all data]

Jordán, Martínez, et al., 2003
Jordán, M.J.; Martínez, R.M.; Cases, M.A.; Sotomayor. J.A., Watering level effect on Thymus hyemalis lange essential oil yield and composition, J. Agric. Food Chem., 2003, 51, 18, 5420-5427, https://doi.org/10.1021/jf034335m . [all data]

Jordán, Goodner, et al., 2002
Jordán, M.J.; Goodner, K.L.; Shaw, P.E., Characterization of the aromatic profile in aqueous essence and fruit juice of yellow passion fruit (Passiflora edulis Sims F. Flavicarpa degner) by GC-MS and GC/O, J. Agric. Food Chem., 2002, 50, 6, 1523-1528, https://doi.org/10.1021/jf011077p . [all data]

Betts, 2000
Betts, T.J., Solid phase microextraction of volatile constituents from individual fresh Eucalyptis leaves of three species, Planta Medica, 2000, 66, 2, 193-195, https://doi.org/10.1055/s-0029-1243133 . [all data]

da Silva, Figueiredo, et al., 1998
da Silva, J.A.; Figueiredo, A.C.; Barroso, J.G.; Pedro, L.G.; Gomes, M.A.; Fontinha, S.S.; Scheffer, J.J.C., Composition of the essential oil of Melanoselinum decipiens (Schrad. Wendl.) Hoffm., an endemic species of the Madeira and Azores archipelagos, Flavour Fragr. J., 1998, 13, 2, 90-92, https://doi.org/10.1002/(SICI)1099-1026(199803/04)13:2<90::AID-FFJ700>3.0.CO;2-D . [all data]

Anitescu, Doneanu, et al., 1997
Anitescu, G.; Doneanu, C.; Radulescu, V., Isolation of Coriander oil: comparison between steam distillation and supercritical CO2 extraction, Flavour Fragr. J., 1997, 12, 3, 173-176, https://doi.org/10.1002/(SICI)1099-1026(199705)12:3<173::AID-FFJ630>3.0.CO;2-1 . [all data]

Gaspar, Palma, et al., 1997
Gaspar, H.; Palma, F.M.S.B.; de la Torre, M.C.; Rodríguez, B.; Barroso, J.G.; Figueiredo, A.C., Composition of the essential oil of Teucrium haenseleri Boiss., Flavour Fragr. J., 1997, 12, 5, 355-357, https://doi.org/10.1002/(SICI)1099-1026(199709/10)12:5<355::AID-FFJ656>3.0.CO;2-B . [all data]

Guth, 1997
Guth, H., Identification of character impact odorants of different white wine varieties, J. Agric. Food Chem., 1997, 45, 8, 3022-3026, https://doi.org/10.1021/jf9608433 . [all data]

Zenkevich, 1997
Zenkevich, I.G., Analytical Parameters of Components of Essential Oils for their Chromatographic and Chromato-Spectral Identificaiton. Oxsigenated derivatives of Mono- and Sesquiterpene Hydrocarbons, Rastit, Resursy (Rus.), 1997, 33, 1, 16-28. [all data]

Garneau, Bouhajib, et al., 1994
Garneau, F.X.; Bouhajib, M.; Collin, G.J.; Gagnon, M.; ApSimon, J.W., The glycosidically bound volatile compounds of Picea mariana (Mill.) B.S.P., J. Essent. Oil Res., 1994, 6, 1, 43-46, https://doi.org/10.1080/10412905.1994.9698323 . [all data]

Shibamoto, 1987
Shibamoto, T., Retention Indices in Essential Oil Analysis in Capillary Gas Chromatography in Essential Oil Analysis, Sandra, P.; Bicchi, C., ed(s)., Hutchig Verlag, Heidelberg, New York, 1987, 259-274. [all data]

Waggott and Davies, 1984
Waggott, A.; Davies, I.W., Identification of organic pollutants using linear temperature programmed retention indices (LTPRIs) - Part II, 1984, retrieved from http://dwi.defra.gov.uk/research/completed-research/reports/dwi0383.pdf. [all data]

Swigar and Silverstein, 1981
Swigar, A.A.; Silverstein, R.M., Monoterpenes, Aldrich Chemical Company, Milwaukee, WI, USA, 1981, 130. [all data]

Duarte, Dias, et al., 2010
Duarte, W.F.; Dias, D.R.; Oliveira, J.M.; Teixeira, J.A.; de Almeida e Silva, J.B.; Schwan, R.F., Characterization of different fruit wines made from cacao,cupuassu, gabiroba, jaboticaba and umbu, Food Sci. Technol., 2010, 43, 1564-1572. [all data]

Miyazawa, Fujita, et al., 2010
Miyazawa, N.; Fujita, A.; Kubota, K., Aroma character impact compounds in Kinokuni Mandarin Orange (Citrus kinikuni) compared with Satsuma Mandarin Orange, Biosci. Biotechnol. Biochem., 2010, 74, 4, 835-842, https://doi.org/10.1271/bbb.90937 . [all data]

Zhao, Xu, et al., 2009
Zhao, Y.; Xu, Y.; Li, J.; Fan, W.; Jiang, W., Profile of volatile compounds in 11 brandies by headspace solid-phase microextraction followed by gas chromatography-mass spectrometry, J. Food. Sci., 2009, 74, 2, c90-c99, https://doi.org/10.1111/j.1750-3841.2008.01029.x . [all data]

Soria, Sanz, et al., 2008
Soria, A.C.; Sanz, J.; Martinez-Castro, I., SPME followed by GC-MS: a powerful technique for qualitative analysis of honey volatiles, Eur. Food Res. Technol., 2008, 1-12. [all data]

Singh, Kumar, et al., 2007
Singh, B.; Kumar, R.; Bhandari, S.; Pathania, S.; Lal, B., Volatile constituents of natural Boswellia serrata oleo-gum-resin and commercial samples, Flavour Fragr. J., 2007, 22, 2, 145-147, https://doi.org/10.1002/ffj.1772 . [all data]

Wei A. and Shibamoto T., 2007
Wei A.; Shibamoto T., Antioxidant activities and volatile constituents of various essential oils, J. Agric. Food Chem., 2007, 55, 5, 1737-1742, https://doi.org/10.1021/jf062959x . [all data]

Choi H.S., 2006
Choi H.S., Lipolytic effects of citrus peel oils and their components, J. Agric. Food Chem., 2006, 54, 9, 3254-3258, https://doi.org/10.1021/jf052409j . [all data]

Ibarz, Ferreira, et al., 2006
Ibarz, M.J.; Ferreira, V.; Hernández-Orte, P.; Loscos, N.; Cacho, J., Optimization and evaluation of a procedure for the gas chromatographic-mass spectrometric analysis of the aromas generated by fast acid hydrolysis of flavor precursors extracted from grapes, J. Chromatogr. A, 2006, 1116, 1-2, 217-229, https://doi.org/10.1016/j.chroma.2006.03.020 . [all data]

Babu and Kaul, 2005
Babu, K.G.D.; Kaul, V.K., Variation in essential oil composition of rose-scented geranium (Pelargonium sp.) distilled by different distillation techniques, Flavour Fragr. J., 2005, 20, 2, 222-231, https://doi.org/10.1002/ffj.1414 . [all data]

Jirovetz, Buchbauer, et al., 2005, 2
Jirovetz, L.; Buchbauer, G.; Ngassoum, M.B.; Parmentier, M., Chemical composition and olfactory characterization of essential oils of fruits and seeds of African pear (Dacryodes edulis (G. Don) H. J. Lam) from Cameroon, Flavour Fragr. J., 2005, 20, 2, 215-218, https://doi.org/10.1002/ffj.1324 . [all data]

Jirovetz, Buchbauer, et al., 2005, 3
Jirovetz, L.; Buchbauer, G.; Stoyanova, A.; Balinova, A.; Guangjiun, Z.; Xihan, M., Solid phase microextraction/gas chromatographic and olfactory analysis of the scent and fixative properties of the essential oil of Rosa damascena L. from China, Flavour Fragr. J., 2005, 20, 1, 7-12, https://doi.org/10.1002/ffj.1375 . [all data]

Joichi, Yomogida, et al., 2005
Joichi, A.; Yomogida, K.; Awano, K.; Ueda, Y., Volatile components of tea-scented modern roses and ancient Chinese roses, Flavour Fragr. J., 2005, 20, 2, 152-157, https://doi.org/10.1002/ffj.1388 . [all data]

Lee, Umano, et al., 2005
Lee, S.-J.; Umano, K.; Shibamoto, T.; Lee, K.-G., Identification of volatile components in basil (Ocimum basilicum L.) and thyme leaves (Thymus vulgaris L.) and their antioxidant properties, Food Chem., 2005, 91, 1, 131-137, https://doi.org/10.1016/j.foodchem.2004.05.056 . [all data]

Njoroge, Koaze, et al., 2005
Njoroge, S.M.; Koaze, H.; Mwaniki, M.; Minh Tu, N.T.; Sawamura, M., Essential oils of Kenyan Citrus fruits: volatile components of two varieties of mandarins (Citrus reticulata) and a tangelo (C. paradisi × C. tangerina), Flavour Fragr. J., 2005, 20, 1, 74-79, https://doi.org/10.1002/ffj.1376 . [all data]

Qian and Wang, 2005
Qian, M.C.; Wang, Y., Seasonal Variations of Volatile Composition and Odor Activity Value of Marion (Rubus spp. hyb) and Thornless Evergreen (R.laciniatus L.) Blackberries, J. Food. Sci., 2005, 70, 1, c13-c20, https://doi.org/10.1111/j.1365-2621.2005.tb09013.x . [all data]

Ram, Kumar, et al., 2005
Ram, P.; Kumar, B.; Naqvi, A.A.; Verma, R.S.; Patra, N.K., Post-harvest storage effect on quantity and quality of rose-scented geranium (Pelargonium sp. cv. 'Bourbon') oil in Uttaranchal, Flavour Fragr. J., 2005, 20, 6, 666-668, https://doi.org/10.1002/ffj.1544 . [all data]

Choi, 2004, 2
Choi, H.-S., Aroma evaluation of an aquatic herb, changpo (Acorus calamus Var. angustatus Bess), by AEDA and SPME, J. Agric. Food Chem., 2004, 52, 26, 8099-8104, https://doi.org/10.1021/jf040239p . [all data]

Jiang and Kubota, 2004
Jiang, L.; Kubota, K., Differences in the volatile components and their odor characteristics of green and ripe fruits and dried pericarp of Japanese pepper (Xanthoxylum piperitum DC.), J. Agric. Food Chem., 2004, 52, 13, 4197-4203, https://doi.org/10.1021/jf030663a . [all data]

Tu, Onishi, et al., 2003
Tu, N.T.M.; Onishi, Y.; Son, U.S.; Ogawa, E.; Ukeda, H.; Sawamura, M., Characteristic odour components of Citrus inflata Hort. Ex Tanaka (Mochiyu) cold-pressed peel oil, Flavour Fragr. J., 2003, 18, 5, 454-459, https://doi.org/10.1002/ffj.1252 . [all data]

Tu, Onishi, et al., 2003, 2
Tu, N.T.M.; Onishi, Y.; Choi, H.S.; Kondo, Y.; Ukeda, H.; Sawamura, M., Characteristic odour components of Citrus sp. (Kiyookadaidai) cold-pressed peel oil, Flavour Fragr. J., 2003, 18, 6, 515-520, https://doi.org/10.1002/ffj.1260 . [all data]

Tu, Onishi, et al., 2002
Tu, N.T.M.; Onishi, Y.; Choi, H.-S.; Kondo, Y.; Bassore, S.M.; Ukeda, H.; Sawamura, M., Characteristic odor components of Citrus sphaerocarpa Tanaka (Kabosu) cold-pressed peel oil, J. Agric. Food Chem., 2002, 50, 10, 2908-2913, https://doi.org/10.1021/jf011578a . [all data]

Tu, Thanh, et al., 2002
Tu, N.T.M.; Thanh, L.X.; Une, A.; Ukeda, H.; Sawamura, M., Volatile constituents of Vietnamese pummelo, orange, tangerine and lime peel oils, Flavour Fragr. J., 2002, 17, 3, 169-174, https://doi.org/10.1002/ffj.1076 . [all data]

Umano, Hagi, et al., 2002
Umano, K.; Hagi, Y.; Shibamoto, T., Volatile chemicals identified in extracts from newly hybrid citrus, dekopon (Shiranuhi mandarin Suppl. J.), J. Agric. Food Chem., 2002, 50, 19, 5355-5359, https://doi.org/10.1021/jf0203951 . [all data]

Christoph, 2001
Christoph, F., Chemische Zuzammensetzung und antimikrobielle Eigenschaften der ätherischen Öle von Leptospermum scoparium J. R. et G. Forst. und anderer Teebaumöle der Gattungen Kunzea, Leptospermum und Melaleuca unter besonderer Berücksichtigung von Handelsölen, Dissertation, University of Hamburg, Germany, 2001, 196. [all data]

Ferreira, Aznar, et al., 2001
Ferreira, V.; Aznar, M.; López, R.; Cacho, J., Quantitative gas chromatography-olfactometry carried out at different dilutions of an extract. Differences in the odor profiles of four high-quality spanish aged red wines, J. Agric. Food Chem., 2001, 49, 10, 4818-4824, https://doi.org/10.1021/jf010283u . [all data]

Jiang, Kojima, et al., 2001
Jiang, L.; Kojima, H.; Yamada, K.; Kobayashi, A.; Kubota, K., Isolation of some glycosides as aroma precursors in young leaves of Japanese pepper (Xanthoxylum piperitum DC.), J. Agric. Food Chem., 2001, 49, 12, 5888-5894, https://doi.org/10.1021/jf0104937 . [all data]

Jiang and Kubota, 2001
Jiang, L.; Kubota, K., Formation by mechanical stimulus of the flavor compounds in young leaves of Japanese pepper (Xanthoxylum piperitum DC.), J. Agric. Food Chem., 2001, 49, 3, 1353-1357, https://doi.org/10.1021/jf001166m . [all data]

Korány, Mednyánszky, et al., 2000
Korány, K.; Mednyánszky, Zs.; Amtmann, M., Preliminary results of a recognition method visualizing the aroma and fragrance features, Acta Aliment., 2000, 29, 2, 187-198, https://doi.org/10.1556/AAlim.29.2000.2.9 . [all data]

Umano, Hagi, et al., 2000
Umano, K.; Hagi, Y.; Nakahara, K.; Shoji, A.; Shibamoto, T., Volatile chemicals identified in extracts from leaves of Japanese mugwort (Artemisia princeps Pamp.), J. Agric. Food Chem., 2000, 48, 8, 3463-3469, https://doi.org/10.1021/jf0001738 . [all data]

Choo, Wong, et al., 1999
Choo, L.-C.; Wong, S.-M.; Liew, K.-Y., Essential oil of nutmeg pericarp, J. Sci. Food Agric., 1999, 79, 13, 1954-1957, https://doi.org/10.1002/(SICI)1097-0010(199910)79:13<1954::AID-JSFA460>3.0.CO;2-I . [all data]

Umano, Nakahara, et al., 1999
Umano, K.; Nakahara, K.; Shoji, A.; Shibamoto, T., Aroma chemicals isolated and identified from leaves of aloe arborescens Mill. Var. natalensis Berger, J. Agric. Food Chem., 1999, 47, 9, 3702-3705, https://doi.org/10.1021/jf990116i . [all data]

Chisowa, Hall, et al., 1998
Chisowa, E.H.; Hall, D.R.; Farman, D.I., Volatile constituents of the essential oil of Cymbopogon citratus Stapf gown in Zambia, Flavour Fragr. J., 1998, 13, 1, 29-30, https://doi.org/10.1002/(SICI)1099-1026(199801/02)13:1<29::AID-FFJ682>3.0.CO;2-S . [all data]

Mölleken, Sinnwell, et al., 1998
Mölleken, U.; Sinnwell, V.; Kubeczka, K.-H., Essential oil composition of Smyrnium olusatrum, Phytochemistry, 1998, 49, 6, 1709-1714, https://doi.org/10.1016/S0031-9422(98)00195-2 . [all data]

Werkhoff, Güntert, et al., 1998
Werkhoff, P.; Güntert, M.; Krammer, G.; Sommer, H.; Kaulen, J., Vacuum headspace method in aroma research: flavor chemistry of yellow passion fruits, J. Agric. Food Chem., 1998, 46, 3, 1076-1093, https://doi.org/10.1021/jf970655s . [all data]

Awano, Honda, et al., 1997
Awano, K.; Honda, T.; Ogawa, T.; Suzuki, S.; Matsunaga, Y., Volatile components of Phalaenopsis schilleriana Rehb. f., Flavour Fragr. J., 1997, 12, 5, 341-344, https://doi.org/10.1002/(SICI)1099-1026(199709/10)12:5<341::AID-FFJ657>3.0.CO;2-L . [all data]

Orav, Kailas, et al., 1996
Orav, A.; Kailas, T.; Liiv, M., Analysis of terpenoic composition of conifer needle oils by steam distillation/extraction, gas chromatography and gas chromatography-mass spectrometry, Chromatographia, 1996, 43, 3/4, 215-219, https://doi.org/10.1007/BF02292955 . [all data]

Wong and Lai, 1996
Wong, K.C.; Lai, F.Y., Volatile constituents from the fruits of four Syzygium species grown in Malaysia, Flavour Fragr. J., 1996, 11, 1, 61-66, https://doi.org/10.1002/(SICI)1099-1026(199601)11:1<61::AID-FFJ539>3.0.CO;2-1 . [all data]

Stancher and Pertoldi, 1967
Stancher, B.; Pertoldi, M.G., Characterization of commercial materials used in synthetic essential oil production. Identification and gas-chromatographic determination of impurities, Rassegna chimica, 1967, 19, 3, 99-109. [all data]

Lee, Chong, et al., 2012
Lee, P.-R.; Chong, I.S.-M.; Yu, B.; Curran, P.; Liu, S.-Q., Effect of precursors on volatile compounds in Papaya wine fermented by mixed yeasts, Uncorrected proof, 2012, 000-000. [all data]

Prompona, Kandylis, et al., 2012
Prompona, K.-D.; Kandylis, P.; Tsakiris, A.; Kanellaki, M.; Kourkoutas, Y., Application of alternative technologies for elimination of artificial colorings in alcoholic beverages produced by Citrus medica and potential impact on human health, Food Nutrition Sci., 2012, 3, 07, 959-969, https://doi.org/10.4236/fns.2012.37127 . [all data]

Canuti, Conversano, et al., 2009
Canuti, V.; Conversano, M.; Li Calzi, M.; Heymann, H.; Matthews, M.A.; Ebeler, S.E., Headspace solid-phase microextraction - gas chromatography - mass spectrometry for profiling free volatile compounds in Cabernet Sauvignon grapes and vines, J. Chromatogr. A., 2009, 1216, 15, 3012-3022, https://doi.org/10.1016/j.chroma.2009.01.104 . [all data]

Genisheva and Oliveira, 2009
Genisheva, Z.; Oliveira, J.M., Monoterpenic characterization of white cultivars from Vinhos Verdes appelation of origin (North Portugal), J. Inst. Brewing, 2009, 115, 4, 308-317, https://doi.org/10.1002/j.2050-0416.2009.tb00386.x . [all data]

Loscos, Hernandez-Orte, et al., 2009
Loscos, N.; Hernandez-Orte, P.; Cacho, J.; Ferreira, V., Fate of grape flavor precursors during storage on yeast lees, J. Agric. Food Chem., 2009, 57, 12, 5468-5479, https://doi.org/10.1021/jf804057q . [all data]

Kaack and Christensen, 2008
Kaack, K.; Christensen, L.P., Effect of packing materials and storage time on volatile compounds in tea processes from flowers of black elder (Sambucus nigra L.), Eur. Food Res. Technol., 2008, 227, 4, 1259-1273, https://doi.org/10.1007/s00217-008-0844-8 . [all data]

Yongsheng, Hua, et al., 2008
Yongsheng, T.; Hua, L.; Hua, W.; Li, Z., Volatile composition of young Cabernet Savignon red wine from Changli Counti (China), J. Food Composition and Analysis, 2008, 21, 8, 689-694, https://doi.org/10.1016/j.jfca.2008.05.007 . [all data]

Baser K.H.C. and Demirci B., 2007
Baser K.H.C.; Demirci B., Studies on Betula essential oils, Arkivoc, 2007, 7, 335-348. [all data]

Loskos, Hernandez-Orte, et al., 2007
Loskos, N.; Hernandez-Orte, P.; Cacho, J.; Ferreira, V., Release and formation of varietal aroma compounds during alcoholic fermentation from nonfloral grape odorless flavor precursors fractions, J. Agric. Food Chem., 2007, 55, 16, 6674-6684, https://doi.org/10.1021/jf0702343 . [all data]

Selli, 2007
Selli, S., Volatile constituents of orange obtained from moro oranges (Citrus Sinensis L. Osbeck), J. Food Quality, 2007, 30, 3, 330-341, https://doi.org/10.1111/j.1745-4557.2007.00124.x . [all data]

Kosar, Özek, et al., 2005
Kosar, M.; Özek, T.; Göger, F.; Kürkcüoglu, M.; Hüsnü Can Baser, K., Comparison of Microwave-Assisted Hydrodistillation and Hydrodistillation Methods for the Analysis of Volatile Secondary Metabolites, Pharm. Biol., 2005, 43, 6, 491-495, https://doi.org/10.1080/13880200500220136 . [all data]

Baser, Özek, et al., 2004
Baser, K.H.C.; Özek, T.; Kirimer, N.; Deliorman, D.; Ergun, F., Composition of the essential oils of Galium aparine L. and Galium odoratum (L.) Scop. from Turkey, J. Essent. Oil Res., 2004, 16, 4, 305-307, https://doi.org/10.1080/10412905.2004.9698728 . [all data]

Demirci and Baser, 2003
Demirci, B.; Baser, K.H.C., Essential oils from the buds of Betula spp. growing in Turkey, Flavour Fragr. J., 2003, 18, 2, 87-90, https://doi.org/10.1002/ffj.1159 . [all data]

Selli, Cabaroglu, et al., 2003
Selli, s.; Cabaroglu, T.; Canbas, A., Flavour components of orange wine made from a Turkish cv. Kozan, Int. J. Food Sci. Technol., 2003, 38, 5, 587-593, https://doi.org/10.1046/j.1365-2621.2003.00691.x . [all data]

Baser, Demirci, et al., 2001
Baser, K.H.C.; Demirci, B.; Tabanca, N.; Özek, T.; Gören, N., Composition of the essential oils of Tanacetum armenum (DC.) Schultz Bip., T. balsamita L., T. chiliophyllum (Fisch. Mey.) Schultz Bip. var. chiliophyllum and T. haradjani (Rech. fil.) Grierson and the enantiomeric distribution of camphor and carvone, Flavour Fragr. J., 2001, 16, 3, 195-200, https://doi.org/10.1002/ffj.977 . [all data]

López and Dufour, 2001
López, M.G.; Dufour, J.P., Chapter 6. Tequilas: charm analysis of Blanco, Teposado, and Anejo tequilas, Am. Chem. Soc. Symp. Ser., 2001, 782, 62-72. [all data]

Tabanca, Kirimer, et al., 2001
Tabanca, N.; Kirimer, N.; Can Baser, K.H., The composition of essential oils from two varieties of Sideritis erythrantha var. erythrantha and var. cedretorum, Turk. J. Chem., 2001, 25, 201-208. [all data]

Kamariah, Lim, et al., 1999
Kamariah, A.S.; Lim, L.B.L.; Baser, K.H.C.; Ozek, T.; Demirci, B., Composition of the essential oil of Plumeria obtusa L., Flavour Fragr. J., 1999, 14, 4, 237-240, https://doi.org/10.1002/(SICI)1099-1026(199907/08)14:4<237::AID-FFJ817>3.0.CO;2-Y . [all data]

Vas, Gal, et al., 1998
Vas, G.; Gal, L.; Harangi, J.; Dobo, A.; Vekey, K., Determination of volatile aroma compounds of Blaeufrankisch wines extracted by solid-phase microextraction, J. Chromatogr. Sci., 1998, 36, 10, 505-510, https://doi.org/10.1093/chromsci/36.10.505 . [all data]

López-Tamames, Carro-Mariño, et al., 1997
López-Tamames, E.; Carro-Mariño, N.; Gunata, Y.Z.; Sapis, C.; Baumes, R.; Bayonove, C., Potential aroma in several varieties of Spanish grapes, J. Agric. Food Chem., 1997, 45, 5, 1729-1735, https://doi.org/10.1021/jf960572w . [all data]

Carro Marino, López Tamames, et al., 1995
Carro Marino, N.; López Tamames, E.; García Jares, C.M., Contribution to the study of the aromatic potential of three muscat Vitis vinifera varieties: identification of new compounds, Food Sci. Technol. Int., 1995, 1, 2-3, 105-116, https://doi.org/10.1177/108201329500100206 . [all data]

Marlatt, Ho, et al., 1992
Marlatt, C.; Ho, C.-T.; Chien, M., Studies of aroma constituents bound as glycosides in tomato, J. Agric. Food Chem., 1992, 40, 2, 249-252, https://doi.org/10.1021/jf00014a016 . [all data]