cobalt sulphate

Condensed phase thermochemistry data

Quantity Value Units Method Reference Comment
Δfsolid-888.26kJ/molReviewChase, 1998Data last reviewed in December, 1971
Quantity Value Units Method Reference Comment
solid117.36J/mol*KReviewChase, 1998Data last reviewed in December, 1971

Solid Phase Heat Capacity (Shomate Equation)

Cp° = A + B*t + C*t2 + D*t3 + E/t2
H° − H°298.15= A*t + B*t2/2 + C*t3/3 + D*t4/4 − E/t + F − H
S° = A*ln(t) + B*t + C*t2/2 + D*t3/3 − E/(2*t2) + G
    Cp = heat capacity (J/mol*K)
    H° = standard enthalpy (kJ/mol)
    S° = standard entropy (J/mol*K)
    t = temperature (K) / 1000.

View plot Requires a JavaScript / HTML 5 canvas capable browser.

View table.

Temperature (K) 298. - 964.964. - 2000.
A 32.86047146.5367
B 311.257821.20100
C -267.3116-5.108664
D 80.829860.931953
E -0.069618-5.436857
F -909.9321-949.2283
G 75.10447260.2331
H -888.2632-888.2632
ReferenceChase, 1998Chase, 1998
Comment Data last reviewed in December, 1971 Data last reviewed in December, 1971

References

Chase, 1998
Chase, M.W., Jr., NIST-JANAF Themochemical Tables, Fourth Edition, J. Phys. Chem. Ref. Data, Monograph 9, 1998, 1-1951. [all data]