Sn2CN anion

Gas phase ion energetics data

Data compiled by: John E. Bartmess

Electron affinity of neutral species

EAneutral (eV) Method Reference Comment
2.270 ± 0.050LPESMoravec and Jarrold, 2000

References

Moravec and Jarrold, 2000
Moravec, V.D.; Jarrold, C.C., Study of tin- and tin cluster-cyano complexes using anion photoelectron spectroscopy and density functional calculations, J. Chem. Phys., 2000, 113, 3, 1035-1045, https://doi.org/10.1063/1.481883 . [all data]