2,3,4,5-tetraMe-benzoate anion

Reaction thermochemistry data

Data compiled by: John E. Bartmess

Individual Reactions

C11H13O2- + Hydrogen cation = 2,3,4,5-Tetramethylbenzoic acid

By formula: C11H13O2- + H+ = C11H14O2

Quantity Value Units Method Reference Comment
Δr1394. ± 8.8kJ/molIMREDecouzon, Gal, et al., 1997gas phase

References

Decouzon, Gal, et al., 1997
Decouzon, M.; Gal, J.-F.; Maria, P.-C.; Bohm, S.; Jimenez, P.; Roux, M.V.; Exner, O., Steric Effects in Crowded Molecules in the Gas Phase: Polymethyl Substituted Benzoic Acids, New J. Chem., 1997, 21, 561. [all data]