(H2O)9..S2O3 dianion

Ion clustering data

Data compiled by: John E. Bartmess

Clustering reactions

H16O11S2-2 + 9Water = H18O12S2-2

By formula: H16O11S2-2 + 9H2O = H18O12S2-2

Quantity Value Units Method Reference Comment
Δr22.2 ± 1.3kJ/molTDAsBlades, Klassen, et al., 1995gas phase

H18O12S2-2 + 10Water = H20O13S2-2

By formula: H18O12S2-2 + 10H2O = H20O13S2-2

Quantity Value Units Method Reference Comment
Δr19.7 ± 1.3kJ/molTDAsBlades, Klassen, et al., 1995gas phase

References

Blades, Klassen, et al., 1995
Blades, A.T.; Klassen, J.S.; Kebarle, P., Free Energies of Hydration in the Gas Phase on the Anions of Some Oxo Acids of C, N, S, P, Cl and I, J. Am. Chem. Soc., 1995, 117, 42, 10563, https://doi.org/10.1021/ja00147a019 . [all data]