LaH2

Vibrational and/or electronic energy levels

Data compiled by: Marilyn E. Jacox

State:   X

Vib.
sym.
 No.   Approximate
 type of mode
 cm-1   Med.   Method   References

a1 1 Sym. stretch 1355.1 Ne IR Wang, Chertihin, et al., 2002
1 Sym. stretch 1320.9 Ar IR Wang, Chertihin, et al., 2002
b2 3 Asym. stretch 1316.8 Ne IR Wang, Chertihin, et al., 2002
3 Asym. stretch 1283.0 Ar IR Wang, Chertihin, et al., 2002

References

Wang, Chertihin, et al., 2002
Wang, X.; Chertihin, G.V.; Andrews, L., Matrix Infrared Spectra and DFT Calculations of the Reactive MH, J. Phys. Chem. A, 2002, 106, 40, 9213, https://doi.org/10.1021/jp026166z . [all data]